program: Gaussian 09
title: 000247323
version: EM64L-G09RevD.01
frameworkgroup: C1[X(C7H14O6)]
method: RPBEPBE
basis: SDD
operation: Freq
keyword: #pfreq=noraman
keyword: PBEPBE/SDD
title: #p freq=noraman PBEPBE/SDD
converged: YES YES NO NO
title: Mulliken charges:
elementType: O O O O O O C C C C C C C H H H H H H H H H H H H H H
charge: -0.299598 -0.347112 -0.445630 -0.456454 -0.407979 -0.442385 -0.084523 -0.115282 -0.058309 -0.202542 -0.062884 -0.354353 -0.514405 0.244337 0.245681 0.263236 0.252383 0.218757 0.205760 0.216112 0.358382 0.357918 0.369622 0.240416 0.220376 0.244496 0.353981
chargesum: 0.00000
title: Mulliken charges with hydrogens summed into heavy atoms:
elementType: O O O O O O C C C C C C C
charge: -0.299598 -0.347112 -0.087248 -0.098536 -0.038357 -0.088403 0.159814 0.130399 0.204927 0.049840 0.155873 0.067518 0.190883
polarizability: 1.01708557e+02 4.25153890e-01 9.58257420e+01 -5.81952149e+00 -5.32601791e-02 8.46597156e+01
1716.lowfreq: -16.0526 -7.4642 0.0008 0.0009 0.0010 10.0813 43.0636 65.3293 98.3354
frequency: 42.9515 65.2277 98.3331 121.5847 123.6648 167.3224 174.0127 194.1747 244.5838 264.3141 279.7384 290.7125 304.2900 341.6239 364.5217 416.3012 454.9235 470.6667 490.2886 504.3665 543.0061 568.2449 597.8424 688.4720 744.5864 792.8021 838.8180 873.6020 901.5089 936.9897 969.6347 986.6248 1001.0953 1018.9346 1026.9698 1046.7536 1071.7031 1090.1686 1107.6865 1116.5160 1149.4535 1182.1535 1201.1272 1210.1085 1244.0820 1251.5932 1277.5082 1287.0446 1298.7742 1317.5660 1319.7621 1327.5581 1350.0789 1372.3849 1380.2964 1387.8546 1401.0539 1436.7748 1458.0204 1460.9457 1479.3209 2965.3061 2996.1846 2999.1312 3003.5103 3018.0897 3032.2279 3061.8504 3068.8898 3091.5042 3115.8162 3440.0717 3492.2219 3534.2497 3577.6550
redmass: 3.8069 3.7299 3.5429 7.6474 4.7974 3.8752 1.1154 4.1319 5.2415 1.1303 4.7264 3.7591 3.5773 4.5058 5.0973 3.4498 3.8694 1.4657 2.5843 1.3351 4.6963 2.8879 1.4618 3.9190 4.7178 3.0495 4.2653 3.5603 3.0178 4.5729 3.1208 4.2454 5.1151 3.1370 3.5708 6.4633 3.3537 2.1253 1.8085 1.2538 1.3226 1.1976 1.2847 1.3166 1.5390 1.2170 1.4477 1.4224 1.1816 1.2880 1.2689 1.3319 1.2504 1.2214 1.3526 1.4490 1.2388 1.1375 1.0898 1.0508 1.0524 1.0315 1.0669 1.0851 1.0865 1.0821 1.0880 1.1040 1.0871 1.0992 1.1019 1.0642 1.0642 1.0651 1.0666
irintensity: 4.4084 3.8212 6.2677 6.9263 1.8180 0.1329 1.2853 3.4797 11.3346 171.2263 7.9793 4.2552 7.0213 13.8313 1.7224 20.8569 10.2227 94.8150 19.5881 129.9431 8.9471 9.9969 254.5215 11.5127 33.9912 18.5598 32.4634 19.3527 38.4553 115.0337 44.6139 117.1872 36.8140 32.9466 41.7557 251.0050 23.2568 12.7673 14.3472 0.4995 2.3425 17.0097 33.1978 31.1667 12.9760 5.8725 10.0383 4.8788 10.8628 16.8929 16.4320 6.5746 1.7314 21.8248 17.0285 27.0261 58.3555 7.8818 6.2110 14.3452 15.3684 60.6359 33.5685 26.3498 60.3914 28.6910 27.3675 32.8636 18.4701 30.8611 19.0007 66.2098 17.1714 8.9468 9.7357
temp: 298.150 k
press: 1.00000 atm
elementType: 8 8 8 8 8 8 6 6 6 6 6 6 6 1 1 1 1 1 1 1 1 1 1 1 1 1 1
symmnumber: 1
zpe: 571370.8 jmol-1
zpe.correction: 0.217624 hartree
zpe.thermalcorrener: 0.231841 hartree
zpe.thermalcorrenthalpy: 0.232785 hartree
zpe.thermalcorrgfe: 0.177147 hartree
zpe.sumelectzpe: -725.352743 hartree
zpe.sumelectthermal: -725.338525 hartree
zpe.sumelectthermalent: -725.337581 hartree
zpe.sumelectthermalfe: -725.393219 hartree
dipole: 5.3359 -0.6670 1.8275
dipole: 5.6795
quadrupole: -81.5510 -76.3317 -79.6215
quadrupole: 5.7662 -0.9474 -8.8205
quadrupole: -2.3829 2.8364 -0.4534 5.7662 -0.9474 -8.8205
hfenergy: -725.5703664 hartree
pointgroup: C01 [X(C7H14O6)]
dipole: -2.2028237 0.118269 0.3556945 debye
polarizability: 99.1107976|-0.5582692|95.586429|8.4056063|1.6180866|87.4967881 unknown
InChI: InChI=1S/C7H14O6/c1-12-6-4(9)3(2-8)13-7(11)5(6)10/h3-11H,2H2,1H3
charge 0 multiplicity 1
27 atoms
O  1.201136 0.694005 -0.405036
O  -1.534725 -0.578068 -0.910783
O  0.214742 -2.392147 -0.098135
O  -0.648009 1.204045 2.187389
O  -0.46622 1.968685 -1.472252
O  3.802981 -0.055146 0.294552
C  -1.169049 -0.433065 0.52224
C  0.154945 -1.234111 0.797304
C  1.388219 -0.306057 0.688886
C  -0.991097 1.075185 0.763164
C  0.099408 1.652919 -0.192099
C  2.696975 -1.016045 0.32806
C  -2.71995 -1.424299 -1.137579
H  -1.987681 -0.819764 1.156378
H  0.121881 -1.662203 1.812398
H  1.511461 0.232267 1.647856
H  -1.938591 1.604225 0.537919
H  0.509649 2.605399 0.197224
H  2.587328 -1.539963 -0.64149
H  2.956499 -1.757342 1.101092
H  0.025089 -2.042919 -1.011012
H  -0.615335 2.161972 2.433946
H  -0.897441 1.129702 -1.801115
H  -2.857083 -1.466816 -2.229468
H  -3.617761 -0.97739 -0.668296
H  -2.551463 -2.4413 -0.737604
H  3.515189 0.679331 -0.308943
