program: Gaussian 09
title: 000247324
version: EM64L-G09RevD.01
frameworkgroup: C1[X(C7H13NO6)]
method: RPBEPBE
basis: SDD
operation: Freq
keyword: #p
keyword: freq=noraman
keyword: PBEPBE/SDD
title: #p freq=noraman PBEPBE/SDD
converged: YES YES NO NO
title: Mulliken charges:
elementType: O O O O O O N C C C C C C C H H H H H H H H H H H H H
charge: -0.483609 -0.470853 -0.479077 -0.429078 -0.206522 -0.315410 -0.353257 -0.209888 -0.132576 -0.153532 -0.087810 -0.366893 -0.102548 -0.055576 0.296010 0.275397 0.236386 0.292834 0.224354 0.225544 0.346964 0.371191 0.247932 0.372608 0.387518 0.368244 0.201647
chargesum: 0.00000
title: Mulliken charges with hydrogens summed into heavy atoms:
elementType: O O O O O O N C C C C C C C
charge: -0.112419 -0.098245 -0.091559 -0.060834 -0.206522 -0.315410 -0.006293 0.086122 0.142821 0.082854 0.205024 0.083005 0.145385 0.146071
polarizability: 1.02637107e+02 -3.00963439e+00 1.05008454e+02 -9.63578916e+00 -1.40019606e+00 9.32680721e+01
1716.lowfreq: -12.8299 -0.0006 -0.0005 -0.0002 4.1707 10.7820 50.9035 65.9265 105.7399
frequency: 50.6089 65.6937 105.7348 111.9667 119.6425 146.3805 153.3145 175.9269 194.2828 222.5918 243.1745 279.1895 284.0028 321.3731 344.1911 386.3329 429.0444 482.5811 508.5582 525.1937 579.0924 609.0567 646.4299 668.8225 698.0686 736.9293 752.3360 772.7408 815.5322 819.6261 898.5753 946.4550 955.9666 971.0401 977.8050 1012.7932 1021.5026 1044.6476 1055.8055 1068.5995 1103.0906 1171.9261 1196.1149 1220.3867 1240.7643 1250.3378 1271.5745 1284.5187 1293.9103 1309.0526 1334.9650 1339.4776 1344.9286 1368.1950 1373.2584 1377.9792 1390.9927 1406.1354 1473.2681 1496.1238 1607.0674 1634.1987 2924.7479 2974.0516 2997.7749 3011.7210 3018.7330 3021.2089 3067.8165 3100.3304 3291.0958 3403.6616 3438.5809 3465.9640 3506.7331
redmass: 5.7828 5.7367 3.4740 7.6083 4.0446 6.5619 4.9696 6.6866 5.3812 5.5470 5.5679 8.0536 3.4784 4.9201 3.7009 5.2365 4.8432 3.9045 2.3076 1.3413 2.9514 1.3321 4.2203 1.1138 2.6475 1.1184 1.1639 3.8499 3.8050 3.5037 3.0321 2.0266 4.6916 1.5953 4.6955 1.9019 3.3755 3.4647 2.9393 2.3214 2.5497 1.1510 1.1885 1.5747 1.4374 1.2486 1.4120 1.1825 1.4945 1.3270 1.3164 1.2534 1.2993 1.2043 1.2230 1.2624 1.3212 1.4207 1.0754 1.8544 8.0744 5.7305 1.0793 1.0877 1.0659 1.0841 1.0850 1.0909 1.0863 1.1000 1.0678 1.0773 1.0646 1.0644 1.0654
irintensity: 0.8353 4.4797 1.5268 1.5836 9.6128 16.0677 5.3498 10.5309 2.5095 10.2286 13.5579 1.2369 23.8699 25.5291 29.0384 18.2215 8.2469 30.9030 26.4128 32.4775 0.7114 138.8436 10.5880 139.7384 10.8627 216.6654 193.0573 23.9917 25.8391 14.5620 41.8570 4.8369 68.4397 1.0498 100.0854 20.6036 22.5216 6.0772 33.2475 15.0580 14.8382 30.8442 20.7637 26.3264 56.3426 10.2861 28.2994 53.5587 23.6660 22.9356 15.1320 26.1746 30.3693 15.1592 25.3860 66.5082 25.6412 71.2286 8.1034 149.7959 347.2384 27.4810 14.9184 78.9988 33.0669 27.0391 4.1369 27.4175 16.6374 26.5240 253.5750 103.8354 36.5422 45.0169 17.9350
temp: 298.150 k
press: 1.00000 atm
elementType: 8 8 8 8 8 8 7 6 6 6 6 6 6 6 1 1 1 1 1 1 1 1 1 1 1 1 1
symmnumber: 1
zpe: 555738.9 jmol-1
zpe.correction: 0.211670 hartree
zpe.thermalcorrener: 0.226412 hartree
zpe.thermalcorrenthalpy: 0.227356 hartree
zpe.thermalcorrgfe: 0.170284 hartree
zpe.sumelectzpe: -779.477232 hartree
zpe.sumelectthermal: -779.462490 hartree
zpe.sumelectthermalent: -779.461546 hartree
zpe.sumelectthermalfe: -779.518618 hartree
dipole: 2.1062 0.7700 0.4453
dipole: 2.2863
quadrupole: -85.3857 -89.1843 -89.3478
quadrupole: 4.2202 -5.0590 -10.6300
quadrupole: 2.5869 -1.2117 -1.3752 4.2202 -5.0590 -10.6300
hfenergy: -779.6889019 hartree
pointgroup: C01 [X(C7H13N1O6)]
dipole: 0.7880957 0.1705069 0.3987045 debye
polarizability: 103.736919|3.5405181|101.9846797|-9.0344636|5.2800525|95.1920345 unknown
InChI: InChI=1S/C7H13NO6/c9-1-4(8-3-11)6(13)7(14)5(12)2-10/h1,3-8,10,12-14H,2H2
charge 0 multiplicity 1
27 atoms
O  -2.05939 -1.765554 0.066413
O  0.507365 -2.444111 0.429796
O  -2.154228 0.701549 1.436968
O  -3.107619 -0.024081 -2.00929
O  2.518936 0.162405 -1.954199
O  0.319254 1.542657 2.269422
N  1.620745 1.13902 0.354379
C  -1.068519 -0.696619 -0.258986
C  0.18303 -1.016913 0.594597
C  -1.750956 0.658856 0.022898
C  1.528154 -0.321774 0.224102
C  -3.071074 0.799159 -0.798023
C  2.00025 -0.687955 -1.188096
C  1.098411 1.928069 1.339977
H  -0.860198 -0.81675 -1.335223
H  -0.04043 -0.802392 1.656216
H  -1.053058 1.482395 -0.22118
H  2.258429 -0.809385 0.911718
H  -3.197202 1.834756 -1.149605
H  -3.908062 0.553165 -0.115049
H  2.177867 1.574821 -0.397179
H  -2.50793 -1.458136 0.905294
H  1.879264 -1.755123 -1.462084
H  -0.372879 -2.912322 0.405247
H  -1.36953 1.013289 1.983573
H  -3.150181 -0.973557 -1.715813
H  1.407251 2.991128 1.244923
