program: Gaussian 09
title: 000247311
version: EM64L-G09RevD.01
frameworkgroup: C1[X(C20H13ClN2)]
method: RPBEPBE
basis: SDD
operation: Freq
keyword: #p
keyword: freq=noraman
keyword: PBEPBE/SDD
title: #p freq=noraman PBEPBE/SDD
converged: YES YES NO NO
title: Mulliken charges:
elementType: Cl N N C C C C C C C C C C C C C C C C C C C C H H H H H H H H H H H H H
charge: -0.046402 0.012397 -0.009865 0.197664 0.287062 0.104023 0.231430 0.332908 -0.379742 -0.384067 -0.327282 -0.380740 -0.377281 -0.465919 -0.230212 -0.231799 -0.237800 -0.213307 -0.204992 -0.184483 -0.121824 -0.308359 -0.342559 0.255614 0.259088 0.270872 0.259500 0.257549 0.273669 0.232729 0.235564 0.235679 0.258834 0.257803 0.235735 0.248515
chargesum: 0.00000
title: Mulliken charges with hydrogens summed into heavy atoms:
elementType: Cl N N C C C C C C C C C C C C C C C C C C C C
charge: -0.046402 0.012397 -0.009865 0.197664 0.287062 0.104023 0.231430 0.332908 -0.124127 -0.124979 -0.056411 -0.121240 -0.119733 -0.192250 0.002517 0.003765 -0.002121 0.045528 0.052811 0.051252 -0.121824 -0.308359 -0.094044
polarizability: 3.68248853e+02 -1.40636107e+00 2.61497490e+02 -1.35061036e+01 9.01815413e+00 1.47047545e+02
1716.lowfreq: -6.4221 -1.9150 -0.0013 -0.0005 0.0014 3.8861 27.9790 34.6060 44.8867
frequency: 27.9782 34.5886 44.8727 57.9131 67.5689 69.6382 76.6647 118.0986 131.4721 156.4198 196.6904 229.4209 245.2587 255.4255 287.3230 297.9935 367.8723 390.0905 390.8742 401.3186 407.7359 408.4528 445.7620 487.4019 505.8556 532.5750 578.1950 606.4965 614.4385 621.8515 625.9384 674.1965 692.9373 703.3126 708.7912 720.7371 726.7389 774.2883 809.8520 826.4530 833.1254 843.6190 855.5353 894.2529 930.7891 935.2789 949.7952 955.6707 968.0225 982.6731 988.6639 989.7822 996.7885 1001.0084 1002.8712 1022.0796 1030.3266 1042.9882 1076.8377 1089.0251 1114.9504 1115.7822 1176.0425 1180.1945 1192.6002 1196.7401 1207.9927 1254.5815 1295.5782 1299.2430 1303.8644 1326.0124 1336.3444 1360.8938 1376.7103 1399.2623 1403.1546 1433.8306 1451.5915 1475.1302 1481.6753 1531.1699 1547.3777 1573.2986 1574.1418 1580.8834 1594.6016 1606.7723 2148.7538 3129.8658 3134.4511 3136.8443 3138.2992 3144.5786 3145.0683 3147.5329 3153.4416 3156.5833 3169.8652 3170.1092 3173.1311 3176.6803
redmass: 8.8079 6.0788 4.0367 5.7078 5.1363 5.1638 5.5594 7.4186 8.2450 8.1809 7.3979 4.4908 5.3173 7.0216 5.7099 5.8021 7.4894 4.3845 5.3380 4.5752 3.0184 3.0003 4.8049 4.2122 4.6526 5.5438 6.2651 7.4606 6.4515 6.8527 7.1954 6.3148 5.9444 1.7286 6.2689 2.3081 2.6269 2.2116 2.0969 1.3076 1.7031 2.7590 1.2480 6.3636 1.3456 1.4708 1.4809 1.3420 1.3716 1.3937 5.5404 1.4896 4.2357 1.3782 3.5450 3.1514 3.0336 2.9697 2.5627 1.6192 1.4006 1.6531 1.0546 2.3600 1.1290 1.1203 1.5039 4.3303 1.9060 3.6259 2.2321 1.4705 1.3808 5.0715 6.9231 3.5176 2.2113 2.3123 2.0944 2.3652 2.3117 6.3513 6.9847 5.9307 7.1142 6.0737 6.1451 5.9997 12.6477 1.0850 1.0871 1.0877 1.0923 1.0925 1.0897 1.0923 1.0885 1.0966 1.1003 1.1014 1.0958 1.0973
irintensity: 0.4180 0.2800 0.6994 0.2592 0.0942 0.3908 2.7206 2.1660 1.4878 0.8249 0.4628 0.3360 1.2621 0.1553 0.9681 2.5591 3.8409 4.8879 6.8611 4.4545 1.7566 1.0463 2.7272 17.2945 2.6958 10.8508 1.7105 4.2237 0.1994 4.0688 0.4699 3.9610 1.4713 47.2340 13.0870 18.1051 25.9664 37.0475 55.3995 3.2806 26.4506 18.6272 1.1975 7.2574 3.3163 2.3121 2.9555 0.2212 0.5879 1.4368 3.2744 4.2690 40.0829 0.6633 13.7631 6.0905 0.7774 2.1570 67.8016 8.1249 7.8417 6.4651 0.0731 0.7179 1.3348 3.1195 2.3967 26.1914 8.6603 0.2788 7.7703 4.3826 3.3820 0.6958 0.3866 2.4762 20.7233 11.6714 11.4007 41.6550 34.9137 17.3594 14.4606 7.5595 2.5767 0.9319 35.4832 2.6732 32.6591 1.7528 7.4635 0.4277 4.0306 16.6713 2.6260 13.4120 3.7293 24.9817 21.4200 26.9558 4.3436 0.9021
temp: 298.150 k
press: 1.00000 atm
elementType: 17 7 7 6 6 6 6 6 6 6 6 6 6 6 6 6 6 6 6 6 6 6 6 1 1 1 1 1 1 1 1 1 1 1 1 1
symmnumber: 1
zpe: 701156.7 jmol-1
zpe.correction: 0.267056 hartree
zpe.thermalcorrener: 0.286225 hartree
zpe.thermalcorrenthalpy: 0.287169 hartree
zpe.thermalcorrgfe: 0.217366 hartree
zpe.sumelectzpe: -1337.912035 hartree
zpe.sumelectthermal: -1337.892866 hartree
zpe.sumelectthermalent: -1337.891922 hartree
zpe.sumelectthermalfe: -1337.961725 hartree
dipole: -3.5740 3.1360 2.5934
dipole: 5.4161
quadrupole: -132.7707 -146.8872 -137.4809
quadrupole: -7.4091 -4.2118 4.2707
quadrupole: 6.2756 -7.8409 1.5654 -7.4091 -4.2118 4.2707
hfenergy: -1338.1790914 hartree
pointgroup: C01 [X(C20H13Cl1N2)]
dipole: -1.2119318 1.3750824 1.0866917 debye
polarizability: 365.5842239|-15.7085579|262.8777093|-13.8236|15.9372216|148.3319547 unknown
InChI: InChI=1S/C20H13ClN2/c21-18-10-8-15(9-11-18)19(13-22)20(16-5-2-1-3-6-16)17-7-4-12-23-14-17/h1-12,14H
charge 0 multiplicity 1
36 atoms
Cl 6.157485 -1.209194 0.314254
N  1.149189 3.096884 -1.103251
N  -0.889319 -3.485168 -0.917178
C  -0.79602 -0.009197 -0.055958
C  -2.273636 -0.156631 0.082281
C  0.041254 -1.109735 -0.242898
C  -0.260703 1.382988 -0.040032
C  1.533246 -1.103794 -0.122158
C  -3.152611 0.770157 -0.548749
C  -2.839794 -1.204355 0.862273
C  -0.695356 2.339657 0.91689
C  2.325734 -1.927494 -0.967974
C  2.188677 -0.335684 0.880011
C  0.649169 1.833015 -1.041874
C  -4.550596 0.635279 -0.426881
C  -4.237707 -1.330856 0.992536
C  -5.099955 -0.415936 0.34458
C  3.730433 -1.960008 -0.848155
C  3.590589 -0.36199 1.016107
C  -0.182158 3.652964 0.869228
C  4.345081 -1.170381 0.142456
C  -0.515155 -2.395909 -0.586772
C  0.744377 3.985495 -0.14578
H  -2.736129 1.58329 -1.153277
H  -2.182798 -1.907608 1.384602
H  -1.416859 2.050462 1.688402
H  1.842929 -2.549826 -1.729249
H  1.600164 0.272734 1.572874
H  0.976341 1.148992 -1.832748
H  -5.21114 1.346536 -0.934552
H  -4.653252 -2.14098 1.601196
H  -6.18625 -0.518222 0.442733
H  4.332084 -2.589666 -1.509508
H  4.086415 0.227277 1.792574
H  -0.489841 4.405455 1.601774
H  1.177913 4.989651 -0.211378
