program: Gaussian 09
title: 000247286
version: EM64L-G09RevD.01
frameworkgroup: C1[X(C19H32O3)]
method: RPBEPBE
basis: SDD
operation: Freq
keyword: #pfreq=noraman
keyword: PBEPBE/SDD
title: #p freq=noraman PBEPBE/SDD
converged: NO YES NO NO
title: Mulliken charges:
elementType: O O O C C C C C C C C C C C C C C C C C C C H H H H H H H H H H H H H H H H H H H H H H H H H H H H H H H H
charge: -0.433720 -0.428601 -0.442918 -0.157310 -0.134302 -0.136849 0.384390 0.423639 -0.061934 -0.210255 -0.570355 -0.504182 -0.535117 -0.236959 -0.485679 -0.530088 -0.476193 -0.534607 -0.839244 -0.875415 -0.437946 -0.059317 0.200037 0.220299 0.214241 0.189422 0.228762 0.197573 0.249732 0.216701 0.209561 0.218699 0.224607 0.246535 0.193160 0.214741 0.250000 0.196621 0.208404 0.228662 0.230909 0.180982 0.209010 0.260436 0.206310 0.227606 0.250480 0.207115 0.215041 0.213395 0.179103 0.338001 0.329534 0.327284
chargesum: 0.00000
title: Mulliken charges with hydrogens summed into heavy atoms:
elementType: O O O C C C C C C C C C C C C C C C C C C C
charge: -0.095719 -0.099067 -0.115634 0.042727 0.085997 0.077392 0.384390 0.423639 0.127488 0.018507 -0.123050 -0.077920 -0.091811 0.009576 -0.077778 -0.083467 -0.039127 -0.122716 -0.163487 -0.190214 -0.009510 0.119785
polarizability: 2.30581568e+02 6.29242326e-02 1.91801470e+02 -2.00561539e+00 -9.78183005e-03 1.79850471e+02
1716.lowfreq: -13.5836 0.0005 0.0006 0.0006 6.6565 12.1544 35.9983 59.7076 79.2789
frequency: 35.2064 59.6489 79.2553 114.0448 130.9477 135.2709 159.6112 163.0058 184.1421 199.4127 228.8496 243.3037 254.2202 263.2045 270.3317 278.5547 296.2291 298.2836 301.3628 314.3220 316.0858 334.7743 341.5505 359.2505 373.7970 382.6704 409.7520 435.2591 452.2480 455.8323 462.7332 473.1248 516.3301 525.8197 543.2904 573.8086 586.4182 610.5329 638.1181 675.8755 740.3200 743.0312 762.6204 797.0873 820.8364 835.4039 836.3438 847.8919 885.6477 899.7361 908.3377 919.0261 925.0104 942.8681 951.2067 965.4300 984.4977 990.1662 992.7454 1009.5501 1011.3630 1022.7592 1027.1827 1030.0298 1033.6343 1047.1326 1057.8356 1068.1407 1085.0149 1096.7073 1103.3365 1115.4684 1117.5845 1130.1225 1138.3495 1143.9184 1157.6866 1170.3232 1181.4532 1189.8016 1203.9545 1213.1901 1222.7770 1232.4768 1239.3588 1242.0510 1250.1849 1258.6603 1264.9227 1267.3344 1278.5053 1282.6526 1287.8113 1292.6479 1303.8253 1308.2289 1313.0297 1321.4037 1326.4259 1332.7827 1338.6637 1339.8370 1345.1755 1347.0777 1350.8004 1351.5737 1363.5224 1381.4446 1383.3548 1387.8413 1393.3863 1397.1133 1450.9435 1462.9143 1463.2286 1467.7504 1471.6849 1472.4549 1475.0609 1477.3558 1480.9083 1487.0393 1501.8826 1506.8127 2905.8987 2917.7422 2933.7618 2935.8983 2955.1616 2960.5788 2962.2163 2964.7390 2967.7865 2971.1517 2974.3444 2978.0573 2984.2573 2995.0827 2999.9564 3016.4129 3025.7937 3029.4405 3030.1500 3035.6880 3042.9759 3044.4453 3044.7800 3049.5749 3054.9553 3061.6851 3073.1676 3075.6153 3092.6053 3549.4391 3550.4380 3580.7390
redmass: 4.9241 4.2803 4.2035 2.4350 2.8506 3.0300 2.0155 1.8041 2.8990 2.9608 2.5484 3.1158 1.5344 2.0621 2.3484 2.8216 2.6098 1.6739 1.5384 1.6927 1.5903 1.3767 2.3345 2.7878 2.6276 3.1036 2.6110 2.9764 2.5229 2.0871 3.3125 2.8481 2.9468 2.8916 3.9322 2.7773 2.8466 3.6148 2.7309 2.5115 2.6372 3.0828 2.7060 2.0013 1.6248 2.1042 2.4378 2.4570 1.9590 1.9156 2.3990 2.0167 2.0222 1.7129 1.8946 2.2251 2.1268 3.2138 2.8330 2.0426 2.1141 2.1471 1.8258 1.8015 2.3595 2.1817 2.0452 1.7643 2.2191 1.8220 1.3554 2.0927 1.5661 2.1165 1.6511 1.8194 1.5894 1.7370 1.9426 1.7012 1.4472 1.9510 1.6288 1.4878 1.4240 1.4058 1.4625 1.3847 1.5629 1.3552 1.3227 1.6159 1.4501 1.4942 1.3612 1.3638 1.3677 1.3382 1.4679 1.3435 1.4201 1.4699 1.4587 1.4796 1.4286 1.3969 1.3989 1.2639 1.1631 1.2329 1.1824 1.6217 1.0893 1.0761 1.0848 1.0784 1.0791 1.0734 1.0776 1.0862 1.0813 1.0744 1.0565 1.0525 1.0803 1.0836 1.0818 1.0787 1.0667 1.0651 1.0665 1.0670 1.0686 1.0400 1.0501 1.0549 1.0631 1.0611 1.0656 1.0974 1.0870 1.0873 1.1001 1.0958 1.0970 1.0937 1.0943 1.0989 1.1016 1.0956 1.0998 1.0996 1.0991 1.0659 1.0656 1.0656
irintensity: 1.3292 0.6565 0.5822 0.6835 7.0139 13.4144 18.3170 40.8343 3.4170 4.6771 44.3783 38.8998 13.3275 4.6492 15.5278 4.5933 4.2495 20.6799 46.7203 88.2146 31.6032 33.6427 37.7571 3.9574 16.5814 1.6798 2.8055 8.4815 1.8766 3.6618 5.7295 1.6805 0.3245 3.4709 3.6986 4.7669 13.5011 4.9283 8.4012 4.6234 0.4125 4.5513 7.6004 9.7222 7.3797 0.6362 6.8536 3.3072 2.4502 23.6771 4.8605 1.5684 16.7265 6.4822 2.3020 24.8943 37.8166 49.3667 80.0858 15.6628 7.1961 6.0443 14.2763 13.4338 30.8351 1.3787 15.4476 40.5713 4.4614 3.9421 15.8825 7.4859 5.0219 3.9657 8.4899 25.4110 4.7750 0.7629 10.2714 10.4771 0.9319 6.8043 13.3665 9.7225 10.2752 10.3263 5.6114 4.9222 9.5355 1.3050 1.9986 0.8782 2.2783 1.3050 0.6762 1.5204 7.7049 0.8793 8.2552 1.7974 2.5719 2.5338 11.4448 22.0572 2.9010 0.6239 15.0517 14.5656 6.9889 9.7559 54.0404 4.4469 7.7423 6.2202 4.5562 13.6228 9.5200 5.1402 10.3719 10.0268 11.1743 8.4526 8.9703 7.1959 12.3396 34.7956 34.2186 5.5546 13.1273 42.0690 24.1765 6.9432 43.0941 18.9615 47.5422 102.3913 28.1487 25.4009 39.6815 42.9624 7.3857 26.7481 81.1161 49.6777 23.9428 49.5604 41.4324 7.4680 53.2765 69.8260 57.0145 24.8125 15.7426 2.2278 6.1881 5.7645
temp: 298.150 k
press: 1.00000 atm
elementType: 8 8 8 6 6 6 6 6 6 6 6 6 6 6 6 6 6 6 6 6 6 6 1 1 1 1 1 1 1 1 1 1 1 1 1 1 1 1 1 1 1 1 1 1 1 1 1 1 1 1 1 1 1 1
symmnumber: 1
zpe: 1258870.2 jmol-1
zpe.correction: 0.479478 hartree
zpe.thermalcorrener: 0.501008 hartree
zpe.thermalcorrenthalpy: 0.501952 hartree
zpe.thermalcorrgfe: 0.432262 hartree
zpe.sumelectzpe: -967.118337 hartree
zpe.sumelectthermal: -967.096808 hartree
zpe.sumelectthermalent: -967.095864 hartree
zpe.sumelectthermalfe: -967.165554 hartree
dipole: 0.0068 3.7349 2.8662
dipole: 4.7079
quadrupole: -135.9568 -140.8901 -142.4650
quadrupole: 1.9965 -4.8247 -3.5130
quadrupole: 3.8139 -1.1195 -2.6944 1.9965 -4.8247 -3.5130
hfenergy: -967.5978158 hartree
pointgroup: C01 [X(C19H32O3)]
dipole: 0.0199184 1.3923288 -1.2214115 debye
polarizability: 230.5917145|-0.6399452|191.7611437|-1.7370815|-0.7519522|179.8806511 unknown
InChI: InChI=1S/C19H32O3/c1-18-8-7-12(20)9-11(18)3-4-13-14-5-6-16(22)19(14,2)10-15(21)17(13)18/h11-17,20-22H,3-10H2,1-2H3
charge 0 multiplicity 1
54 atoms
O  0.418817 -2.702758 -0.721503
O  4.866107 -0.784519 1.373003
O  -4.467844 0.597078 2.442418
C  -0.460534 -0.376838 -0.054564
C  0.463642 0.70719 -0.712596
C  1.727576 0.883051 0.154326
C  -1.811058 -0.575652 -0.846842
C  2.533307 -0.434421 0.355947
C  -2.556771 0.810776 -0.926526
C  0.267943 -1.698064 0.361699
C  1.622975 -1.44892 1.082547
C  -0.301252 2.049841 -0.848334
C  2.803473 1.926568 -0.251171
C  3.716448 0.113889 1.218302
C  -1.661077 1.902144 -1.567413
C  -2.75375 -1.599424 -0.13716
C  4.066508 1.498412 0.570115
C  -3.129263 1.271687 0.444082
C  -1.590169 -1.106147 -2.294753
C  3.113529 -1.004446 -0.969669
C  -3.289823 -1.132943 1.234705
C  -4.031871 0.200665 1.087051
H  -0.737927 0.065848 0.928816
H  0.766604 0.383811 -1.731043
H  1.366586 1.172667 1.170023
H  -3.429201 0.65077 -1.598919
H  -0.389479 -2.237148 1.066772
H  1.403984 -1.056198 2.097893
H  2.12568 -2.424904 1.216288
H  0.327578 2.781039 -1.392656
H  -0.457385 2.469094 0.167696
H  2.491371 2.960615 -0.024215
H  2.99972 1.878447 -1.339782
H  3.369085 0.249417 2.258747
H  -2.19497 2.87397 -1.558518
H  -1.485155 1.653147 -2.632155
H  -2.239238 -2.572783 -0.044226
H  -3.619847 -1.776151 -0.810031
H  4.957873 1.39729 -0.079365
H  4.328075 2.236111 1.348093
H  -2.324101 1.512703 1.163593
H  -3.707068 2.207847 0.288921
H  -0.827772 -0.536591 -2.854949
H  -1.27896 -2.163095 -2.269186
H  -2.536969 -1.033476 -2.864891
H  3.938852 -0.37937 -1.361827
H  3.503102 -2.026262 -0.814702
H  2.363775 -1.042032 -1.782014
H  -3.977345 -1.888642 1.657587
H  -2.471729 -0.999691 1.96883
H  -4.924752 0.04792 0.436856
H  1.003431 -2.333547 -1.428115
H  5.330162 -0.860827 0.500626
H  -4.939698 1.46685 2.382194
