program: Gaussian 09
title: 000020211
version: EM64L-G09RevD.01
frameworkgroup: C1[X(C8H3Cl2F3N2)]
method: RPBEPBE
basis: SDD
operation: Freq
keyword: #p
keyword: freq=noraman
keyword: PBEPBE/SDD
title: #p freq=noraman PBEPBE/SDD
converged: NO NO NO NO
title: Mulliken charges:
elementType: Cl Cl F F F N N C C C C C C C C H H H
charge: 0.012286 -0.032401 -0.112930 -0.157504 -0.157596 -0.433817 0.013701 0.362169 0.173739 0.122965 -0.373526 -0.279524 0.262201 -0.067849 -0.233310 0.343845 0.274046 0.283506
chargesum: 0.00000
title: Mulliken charges with hydrogens summed into heavy atoms:
elementType: Cl Cl F F F N N C C C C C C C C
charge: 0.012286 -0.032401 -0.112930 -0.157504 -0.157596 -0.089972 0.013701 0.362169 0.173739 0.122965 -0.099481 -0.279524 0.262201 -0.067849 0.050196
polarizability: 1.82615929e+02 5.17538890e+00 1.36797630e+02 1.08219221e-03 -1.64366844e-03 5.16757417e+01
1716.lowfreq: -17.0971 -0.0016 0.0007 0.0016 4.2540 4.3841 12.5001 61.1310 99.7029
frequency: -16.3801 61.1151 99.6996 135.8883 150.1168 159.8918 217.5508 236.0217 267.7146 294.1786 352.4282 380.9765 384.0829 405.4465 470.7202 489.6686 539.7323 558.5687 582.4592 616.1502 625.9618 660.6687 702.8130 735.7938 772.4988 845.0000 850.6552 857.8058 914.3407 957.6339 964.9499 1035.5648 1073.9620 1097.5327 1179.6111 1228.4795 1237.8299 1291.5795 1349.8110 1381.1776 1418.1839 1464.7367 1522.4149 1572.4620 1625.8943 3179.3090 3182.8074 3584.2858
redmass: 16.7219 12.7839 18.1933 9.6374 8.4615 25.0396 14.5270 5.9477 17.7728 6.0501 12.5622 14.2960 12.1971 11.7041 9.2159 13.4694 4.9559 7.5686 2.9043 8.6118 1.3334 10.7359 10.7094 9.9950 5.2220 7.1764 1.5806 1.3957 11.5506 7.2539 12.1159 8.0997 2.0433 5.4285 2.4772 2.0387 2.5615 3.4835 4.3003 3.9222 7.7336 4.2386 5.5819 9.1682 8.5145 1.0942 1.0933 1.0821
irintensity: 0.7780 1.4435 0.7946 2.9369 3.2947 0.7214 3.4880 6.9517 1.1288 0.7157 0.8838 11.4397 0.6847 10.1404 10.2868 0.7237 4.4019 5.4372 0.0249 5.1256 85.4610 2.2311 1.1685 46.2328 7.0464 32.4348 48.3892 8.8963 27.9594 97.4746 278.2368 184.3120 36.3550 152.9677 25.7451 201.4401 32.5957 151.5923 30.6374 27.6313 21.9754 42.2859 92.2683 94.4488 62.5007 0.3262 1.2853 93.8296
temp: 298.150 k
press: 1.00000 atm
elementType: 17 17 9 9 9 7 7 6 6 6 6 6 6 6 6 1 1 1
symmnumber: 1
zpe: 261480.8 jmol-1
zpe.correction: 0.099593 hartree
zpe.thermalcorrener: 0.111425 hartree
zpe.thermalcorrenthalpy: 0.112369 hartree
zpe.thermalcorrgfe: 0.060473 hartree
zpe.sumelectzpe: -1634.742498 hartree
zpe.sumelectthermal: -1634.730666 hartree
zpe.sumelectthermalent: -1634.729722 hartree
zpe.sumelectthermalfe: -1634.781618 hartree
dipole: -1.8343 -3.8163 0.0005
dipole: 4.2343
quadrupole: -109.5447 -93.4088 -100.3375
quadrupole: -5.8357 0.0021 -0.0009
quadrupole: -8.4477 7.6882 0.7594 -5.8357 0.0021 -0.0009
hfenergy: -1634.8420911 hartree
pointgroup: C01 [X(C8H3Cl2F3N2)]
dipole: -0.6988982 1.5121854 -0.0005131 debye
dipolederiv: -0.0800952 -0.006647 -0.0000301 -0.0574257 -0.7624556 -0.0000666 -0.0000362 -0.0000639 -0.0173714 -0.7249781 0.2656623 -0.0002959 0.3319501 -0.2671269 0.0001478 -0.0002978 0.0001269 -0.0507831 -0.5939551 0.2234614 -0.0004019 0.2463453 -0.6117609 0.0004568 -0.0003371 0.0005086 -0.2565416 -0.7332029 -0.1220642 0.1585411 -0.2681028 -0.4215549 0.2297374 0.2429629 0.2016223 -0.633074 -0.7324609 -0.1220944 -0.1585871 -0.2679989 -0.4221864 -0.2301755 -0.242559 -0.2019509 -0.6326956 -0.4409805 0.0621244 -0.000108 -0.2513218 -0.5356405 -0.000076 0.0000321 0.0001749 -0.2358607 -0.0881503 -0.1354464 0.0000385 0.0828824 -0.3442824 0.0000507 -0.0002035 -0.0001368 -0.2032193 0.4097225 0.0859422 0.0001099 0.1222704 0.0922462 0.000041 0.0001307 0.0000108 0.0972948 -0.0271059 0.0299499 -0.0000406 -0.1025945 -0.3532711 -0.0000594 0.0000171 0.0000197 0.0365384 -0.6475612 -0.1773697 -0.0001844 -0.0631385 0.6298212 -0.0000958 -0.0005914 -0.0001974 -0.0547492 -0.3496765 -0.0174992 -0.0000717 0.0437878 -0.136623 0.0000055 -0.0000843 -0.0000107 -0.153607 0.4540904 -0.0858881 0.0002346 0.1794339 1.2801406 0.0001767 0.0002708 0.000076 -0.0506421 2.5579473 0.0827419 0.0006461 0.1998092 1.4151412 -0.0000286 0.0005787 -0.0000632 1.5701744 1.0332309 -0.3364658 0.000464 -0.5612377 0.6079127 -0.0002625 0.0004675 -0.0001498 -0.0556577 -0.3922174 0.2566837 -0.0001355 0.3211715 -0.4957705 0.0001263 -0.0001343 0.0000775 -0.085144 0.2265631 0.038268 -0.0000684 0.0598069 0.2427565 0.0000171 -0.0000919 -0.0000188 0.3550243 0.0822692 -0.0039077 -0.0000515 0.0123477 0.0009618 0.0000167 -0.0000591 -0.0000015 0.195858 0.0465608 -0.0374514 -0.0000589 -0.0279854 0.0816921 -0.0000115 -0.0000653 -0.0000237 0.1744558 unknown
polarizability: 182.4490224|-5.8653839|136.9645051|0.0639357|-0.0032624|51.6757729 unknown
InChI: InChI=1S/C8H3Cl2F3N2/c9-3-1-4(10)6-5(2-3)14-7(15-6)8(11,12)13/h1-2,14H
charge 0 multiplicity 1
18 atoms
Cl -1.684267 -3.16901 -0.000925
Cl -4.576168 1.558448 -0.00208
F  3.663738 -1.066385 0.003115
F  3.498337 0.903924 -1.131576
F  3.497791 0.905623 1.134045
N  0.749473 1.231575 0.000223
N  0.828303 -1.060569 0.000368
C  -0.583906 0.811185 -0.000321
C  -0.510126 -0.629239 -0.000244
C  1.539219 0.074108 0.000727
C  -1.799208 1.52662 -0.000941
C  -1.717469 -1.368606 -0.000799
C  3.030185 0.173274 0.001561
C  -2.957266 0.73324 -0.001374
C  -2.945283 -0.689128 -0.001338
H  1.089399 2.193311 0.000468
H  -1.855374 2.6176 -0.001039
H  -3.886378 -1.244569 -0.001771
