program: Gaussian 09
title: 000249049
version: EM64L-G09RevD.01
frameworkgroup: C1[X(C8H17Cl3NO2P)]
method: RPBEPBE
basis: SDD
operation: Freq
keyword: #p
keyword: freq=noraman
keyword: PBEPBE/SDD
title: #p freq=noraman PBEPBE/SDD
converged: YES YES NO NO
title: Mulliken charges:
elementType: Cl Cl Cl P O O N C C C C C C C C H H H H H H H H H H H H H H H H H
charge: -0.057762 -0.054938 -0.083745 1.243067 -0.518405 -0.595205 -0.504384 -0.272459 -0.330238 -0.943957 -0.227224 -0.572781 -0.562610 -0.360364 -0.566045 0.236365 0.269443 0.249072 0.253161 0.255974 0.283384 0.290984 0.225732 0.210170 0.288544 0.257578 0.280588 0.275562 0.230087 0.230300 0.272923 0.297183
chargesum: 0.00000
title: Mulliken charges with hydrogens summed into heavy atoms:
elementType: Cl Cl Cl P O O N C C C C C C C C
charge: -0.057762 -0.054938 -0.083745 1.243067 -0.518405 -0.595205 -0.504384 0.233348 0.171994 -0.113614 0.208678 -0.026659 -0.006460 0.100023 0.004061
polarizability: 1.73272481e+02 3.98980425e+00 1.60130288e+02 5.70836512e+00 -3.61268542e-01 1.22293055e+02
1716.lowfreq: -7.9936 -1.3951 -0.0039 -0.0031 -0.0017 7.2992 13.1358 21.3698 35.4280
frequency: 12.1607 20.8924 35.4210 43.7140 51.3058 75.8804 81.2161 102.0487 109.3400 117.9118 169.8226 183.0013 196.1427 205.3641 211.7381 219.8731 221.9285 230.5052 282.9530 287.4166 325.0020 362.5414 379.7475 409.1752 441.3524 482.8659 582.4273 605.3128 657.2307 689.0709 691.4545 718.4916 771.7924 777.3886 802.1319 884.7580 911.4719 919.9931 934.6836 943.4332 998.9978 1003.9635 1025.1802 1038.4649 1041.3190 1047.9763 1068.2329 1107.6324 1108.8710 1147.8553 1177.2365 1190.2010 1227.5922 1256.7593 1260.2922 1262.5795 1285.1111 1299.7138 1322.9707 1333.5167 1345.4110 1358.3464 1364.6745 1366.5441 1430.0852 1435.1765 1442.7399 1448.2116 1456.4071 1461.5897 1473.0947 1476.2993 1482.8950 2972.8023 2993.0349 2996.6944 3017.1626 3019.7673 3040.6536 3057.0715 3057.2414 3062.0451 3069.6056 3074.2419 3076.3812 3133.2395 3138.8810 3145.4938 3147.8698 3159.6052
redmass: 7.6666 6.6217 12.5841 12.9735 6.6962 6.5437 6.2993 2.4881 2.7650 3.1327 3.0194 4.2737 3.5267 3.6510 4.0083 3.9791 1.7643 1.8414 3.9692 3.5104 3.4563 3.4931 3.3354 5.5033 3.2452 5.3317 4.2195 4.8204 5.7416 5.7082 4.9395 5.2046 1.1642 1.1943 1.5848 2.6329 1.8136 2.3114 2.9176 1.3845 1.4933 2.0194 3.4084 1.5679 1.7530 5.7257 2.9599 2.0144 2.0360 1.2924 1.1006 1.8706 1.5668 1.1536 1.1776 1.1485 1.1326 1.1738 1.1697 1.1802 1.2176 1.2740 1.2787 1.5409 1.0858 1.0493 1.0535 1.0969 1.0810 1.0942 1.0884 1.0723 1.0775 1.0564 1.0622 1.0635 1.0328 1.0602 1.1043 1.0761 1.0781 1.0574 1.0991 1.0612 1.1042 1.1008 1.1024 1.1114 1.1122 1.1115
irintensity: 1.6335 1.7711 0.8238 0.7165 1.2027 3.7928 1.3434 1.8729 0.4297 9.9519 4.4963 0.3915 7.0677 3.3229 2.2998 3.0596 1.7736 7.4338 11.9288 17.0381 13.7983 1.1525 19.5126 27.6892 9.2546 20.2468 18.2904 15.8963 36.6168 90.2124 69.0538 124.3095 0.3015 16.2536 5.8867 18.2442 47.6454 107.9543 64.7943 92.3271 5.2117 62.2788 0.2969 5.8556 15.6071 104.2541 49.1434 55.0830 5.5160 3.7218 3.5962 41.2098 2.6026 12.1135 4.7171 8.3913 1.5174 17.0603 10.5328 25.4694 8.1515 4.9719 0.1996 1.8148 15.0913 13.5859 9.8685 12.3126 16.3969 2.0139 30.7654 2.8211 15.6637 32.6202 17.1267 20.7193 1.0494 13.3393 30.3845 10.0231 19.9789 15.5485 5.4030 23.4568 9.7632 2.3988 4.2192 11.4176 2.7083 8.0698
temp: 298.150 k
press: 1.00000 atm
elementType: 17 17 17 15 8 8 7 6 6 6 6 6 6 6 6 1 1 1 1 1 1 1 1 1 1 1 1 1 1 1 1 1
symmnumber: 1
zpe: 658285.2 jmol-1
zpe.correction: 0.250728 hartree
zpe.thermalcorrener: 0.270625 hartree
zpe.thermalcorrenthalpy: 0.271569 hartree
zpe.thermalcorrgfe: 0.197900 hartree
zpe.sumelectzpe: -2240.405386 hartree
zpe.sumelectthermal: -2240.385489 hartree
zpe.sumelectthermalent: -2240.384544 hartree
zpe.sumelectthermalfe: -2240.458214 hartree
dipole: 1.1969 -3.9394 -4.0880
dipole: 5.8020
quadrupole: -128.6282 -123.0227 -128.3184
quadrupole: -10.3039 2.5620 10.2703
quadrupole: -1.9717 3.6337 -1.6620 -10.3039 2.5620 10.2703
hfenergy: -2240.6561136 hartree
pointgroup: C01 [X(C8H17Cl3N1O2P1)]
dipole: 0.8522864 1.2812993 1.6859695 debye
polarizability: 170.2337694|-6.8418685|163.3123438|-4.3909876|2.7137112|122.149711 unknown
InChI: InChI=1S/C8H17Cl3NO2P/c1-15(13,14-8-2-3-9)12(6-4-10)7-5-11/h2-8H2,1H3
charge 0 multiplicity 1
32 atoms
Cl -0.263482 -3.964192 -0.682942
Cl -5.06291 0.706953 0.695901
Cl 3.480057 -2.176095 0.845953
P  -0.177989 1.496072 -0.523659
O  1.519494 1.085488 -0.384249
O  -0.48096 1.920831 -2.030647
N  -0.990694 0.040909 0.081587
C  -0.764113 -1.217729 -0.684731
C  -2.316543 0.178324 0.734995
C  -0.508379 2.814187 0.757483
C  2.156761 0.891537 0.940399
C  -0.284622 -2.327041 0.263041
C  -3.433106 0.573235 -0.253503
C  3.642592 0.640646 0.665121
C  3.919288 -0.616701 -0.155291
H  -1.687938 -1.541545 -1.201588
H  -0.006787 -1.042757 -1.468803
H  -2.570994 -0.7854 1.210893
H  -2.263495 0.924476 1.547062
H  -0.316218 2.445893 1.776796
H  -1.550146 3.160691 0.674489
H  0.160132 3.661033 0.533642
H  1.692051 0.034607 1.465439
H  2.040289 1.804704 1.55774
H  0.74572 -2.17083 0.611891
H  -0.970289 -2.486041 1.108722
H  -3.267168 1.5586 -0.714715
H  -3.601434 -0.182662 -1.033944
H  4.187073 0.595676 1.627249
H  4.040703 1.50449 0.096029
H  4.985232 -0.736328 -0.395609
H  3.298571 -0.666229 -1.060451
