program: Gaussian 09
title: 000249029
version: EM64L-G09RevD.01
frameworkgroup: C1[X(C9H16N2O)]
method: RPBEPBE
basis: SDD
operation: Freq
keyword: #p
keyword: freq=noraman
keyword: PBEPBE/SDD
title: #p freq=noraman PBEPBE/SDD
converged: YES YES NO NO
title: Mulliken charges:
elementType: O N N C C C C C C C C C H H H H H H H H H H H H H H H H
charge: -0.316554 -0.184305 -0.148615 -0.091325 -0.206516 -0.419317 -0.419488 -0.378426 -0.394904 0.279130 -0.626213 -0.626494 0.235633 0.224721 0.214621 0.214746 0.186756 0.223405 0.202125 0.189361 0.203147 0.209284 0.282113 0.215350 0.219718 0.274967 0.216107 0.220973
chargesum: 0.00000
title: Mulliken charges with hydrogens summed into heavy atoms:
elementType: O N N C C C C C C C C C
charge: -0.316554 -0.184305 -0.148615 0.144308 0.018204 0.010051 -0.009327 0.013060 0.017527 0.279130 0.090968 0.085553
polarizability: 1.41966888e+02 -3.35055385e+00 1.01677435e+02 7.35173916e+00 -3.70421702e-01 8.87200421e+01
1716.lowfreq: -7.7673 -0.0007 -0.0006 -0.0001 1.8855 17.6607 56.3289 70.6929 97.2827
frequency: 56.1048 70.6307 97.2075 122.3773 129.1301 163.3540 196.5358 229.5794 285.5839 332.7436 350.8516 390.4206 407.7677 454.3262 525.6719 541.7627 616.5820 661.3277 704.1718 762.0587 805.6165 826.6791 856.5527 872.2798 883.4608 925.9621 950.7871 970.5817 997.1392 1053.8611 1066.6863 1068.5229 1099.3862 1105.8662 1116.2486 1132.3003 1146.9185 1168.4052 1187.2283 1233.6346 1241.8639 1253.5853 1271.5290 1289.5013 1313.9252 1318.0881 1332.5418 1342.6237 1349.9237 1365.7640 1381.2931 1422.6691 1435.8334 1450.9712 1462.5870 1469.9071 1470.5163 1476.2887 1476.9752 1484.1384 1494.2265 1664.5812 2930.4607 2949.6597 2957.2155 2968.1705 2976.5190 2982.7330 2991.2965 3017.1203 3027.0669 3034.9433 3040.9818 3047.3344 3052.5601 3072.1611 3114.3992 3129.5757
redmass: 1.5359 2.8756 1.9983 2.8356 1.0936 2.9855 3.0038 2.4926 2.4986 2.6849 2.0660 3.3098 3.5760 2.6055 3.9930 3.0902 4.0955 7.8873 2.6311 2.6968 2.3324 4.8486 2.6557 2.7407 2.6991 1.9367 2.6089 3.4481 2.5466 1.5991 1.3636 1.7243 1.2445 1.5781 1.3656 2.2493 1.3615 2.2486 1.3830 1.3370 1.4436 4.0037 1.3658 1.3696 1.4455 1.4595 1.3725 1.4964 1.4597 1.4455 3.5930 1.1419 1.1704 1.0836 1.0912 1.0864 1.0551 1.0560 1.0799 1.0510 1.1397 6.7883 1.0826 1.0385 1.0384 1.0637 1.0659 1.0620 1.0611 1.1000 1.1001 1.0960 1.0992 1.0976 1.1004 1.0939 1.0972 1.0951
irintensity: 1.6591 1.4984 0.2977 0.1354 0.7762 7.7103 2.6337 4.1280 0.7803 3.2579 1.8083 5.5564 2.7428 3.6241 12.5905 1.4226 1.5861 10.9655 1.2512 3.7128 9.0003 25.4922 10.7663 5.2224 68.3981 39.1879 24.1986 19.4590 9.1897 13.1719 7.1386 1.7864 2.4051 11.9007 1.3640 72.7887 2.6286 37.5648 3.0819 8.5023 4.5100 29.8124 3.1483 55.1404 4.6678 9.4108 3.8484 1.8320 10.3684 3.4256 54.2718 21.5150 2.8268 9.4676 9.3768 12.5934 11.2442 4.4259 21.6241 33.6134 20.4732 596.9818 49.9919 54.2252 164.5130 38.3431 59.8485 26.8815 21.1523 60.3684 34.5718 60.7121 58.5242 1.9370 37.8484 75.2770 2.4347 3.6818
temp: 298.150 k
press: 1.00000 atm
elementType: 8 7 7 6 6 6 6 6 6 6 6 6 1 1 1 1 1 1 1 1 1 1 1 1 1 1 1 1
symmnumber: 1
zpe: 637776.1 jmol-1
zpe.correction: 0.242916 hartree
zpe.thermalcorrener: 0.255053 hartree
zpe.thermalcorrenthalpy: 0.255997 hartree
zpe.thermalcorrgfe: 0.204573 hartree
zpe.sumelectzpe: -536.315349 hartree
zpe.sumelectthermal: -536.303213 hartree
zpe.sumelectthermalent: -536.302269 hartree
zpe.sumelectthermalfe: -536.353692 hartree
dipole: 0.3900 -1.1161 0.4233
dipole: 1.2558
quadrupole: -61.7497 -75.7634 -72.3630
quadrupole: 0.7957 3.6308 -0.6786
quadrupole: 8.2090 -5.8047 -2.4043 0.7957 3.6308 -0.6786
hfenergy: -536.5582655 hartree
pointgroup: C01 [X(C9H16N2O1)]
dipole: 0.1475756 -0.4467033 0.1508782 debye
polarizability: 141.4478065|-3.8024108|101.7052168|8.8300234|0.0866329|89.2113412 unknown
InChI: InChI=1S/C9H16N2O/c1-11(2)9-10-7-5-3-4-6-8(7)12-9/h7-8H,3-6H2,1-2H3
charge 0 multiplicity 1
28 atoms
O  0.676129 -1.104825 -0.745229
N  0.342714 1.132376 -0.107687
N  2.46765 0.055027 0.286633
C  -0.812231 -0.850557 -0.849618
C  -0.868228 0.711575 -0.896072
C  -1.491831 -1.484862 0.380774
C  -2.182072 1.337363 -0.38472
C  -2.878859 -0.862564 0.668815
C  -2.734913 0.660721 0.88819
C  1.166277 0.104239 -0.150067
C  3.088756 1.27605 0.814162
C  3.230088 -1.19614 0.36374
H  -1.133577 -1.32066 -1.793412
H  -0.718604 1.041584 -1.947647
H  -0.842288 -1.308646 1.260061
H  -1.5621 -2.579559 0.242086
H  -2.942656 1.262239 -1.189219
H  -1.996963 2.413495 -0.212073
H  -3.321759 -1.347525 1.559528
H  -3.571502 -1.052991 -0.177538
H  -3.710246 1.11002 1.156439
H  -2.044202 0.844431 1.734932
H  2.427298 2.12851 0.5975
H  4.075096 1.439725 0.338276
H  3.235106 1.210325 1.911517
H  2.638485 -2.015679 -0.067841
H  3.476914 -1.446584 1.416006
H  4.17892 -1.10509 -0.201037
