program: Gaussian 09
title: 000249007
version: EM64L-G09RevD.01
frameworkgroup: C1[X(C4HCl3N2)]
method: RPBEPBE
basis: SDD
operation: Freq
keyword: #p
keyword: freq=noraman
keyword: PBEPBE/SDD
title: #p freq=noraman PBEPBE/SDD
converged: NO NO NO NO
title: Mulliken charges:
elementType: Cl Cl Cl N N C C C C H
charge: 0.061948 0.058757 0.058757 0.064768 0.064768 -0.005200 -0.126051 -0.126051 -0.321968 0.270271
chargesum: 0.00000
title: Mulliken charges with hydrogens summed into heavy atoms:
elementType: Cl Cl Cl N N C C C C
charge: 0.061948 0.058757 0.058757 0.064768 0.064768 -0.005200 -0.126051 -0.126051 -0.051697
polarizability: 1.12461153e+02 1.77676644e-04 1.04342364e+02 -5.28560682e-05 -5.12358018e-03 3.06329059e+01
1716.lowfreq: -6.0575 -4.6321 0.0022 0.0026 0.0033 11.3858 63.0853 188.7527 191.5741
frequency: 63.0393 188.7524 191.5683 197.2305 250.8931 332.0563 396.7938 450.0977 474.6405 514.2668 573.3413 727.8643 747.6542 753.1932 922.4676 973.2821 1147.4988 1170.6448 1249.7493 1276.3597 1376.7819 1449.1014 1479.0711 3199.2511
redmass: 20.1893 14.6149 33.5557 27.7465 7.0676 30.7898 13.8145 11.1582 15.8865 4.3673 12.4283 10.9189 8.4748 12.1229 1.4526 12.8613 8.6959 4.2141 11.9753 11.3603 1.4058 7.2055 12.3532 1.0936
irintensity: 0.2323 0.0000 0.0177 0.0112 0.1283 0.0314 6.3314 1.1549 15.2755 6.0761 0.0000 7.0902 4.3021 113.8594 11.7001 50.3007 8.2872 58.2549 0.3509 145.2555 104.8675 260.2472 47.5788 4.2756
temp: 298.150 k
press: 1.00000 atm
elementType: 17 17 17 7 7 6 6 6 6 1
symmnumber: 1
zpe: 120258.2 jmol-1
zpe.correction: 0.045804 hartree
zpe.thermalcorrener: 0.053703 hartree
zpe.thermalcorrenthalpy: 0.054647 hartree
zpe.thermalcorrgfe: 0.011457 hartree
zpe.sumelectzpe: -1642.037177 hartree
zpe.sumelectthermal: -1642.029277 hartree
zpe.sumelectthermalent: -1642.028333 hartree
zpe.sumelectthermalfe: -1642.071524 hartree
dipole: 0.0000 -0.0636 0.0001
dipole: 0.0636
quadrupole: -78.2947 -69.0111 -70.9044
quadrupole: 0.0000 0.0000 -0.0006
quadrupole: -5.5580 3.7257 1.8323 0.0000 0.0000 -0.0006
hfenergy: -1642.0829805 hartree
pointgroup: C01 [X(C4H1Cl3N2)]
dipole: -0.0000003 0.0250247 -0.0000405 debye
dipolederiv: 0.0057561 -0.0000618 0. -0.000062 -0.7332717 0.000063 0.0000001 0.0001498 0.0226926 -0.706515 -0.2880189 0.0000496 -0.3270846 -0.1792515 0.0000188 0.0001301 0.0000481 -0.026154 -0.7064088 0.288113 -0.0000499 0.327179 -0.1793616 0.000019 -0.0001302 0.0000479 -0.0261554 -0.5869293 -0.0064739 -0.0000302 -0.3561904 -0.758988 0.000063 0.0000401 -0.0000238 -0.1338323 -0.5868658 0.0064454 0.0000294 0.3561653 -0.7590653 0.0000623 -0.0000404 -0.0000241 -0.133831 -0.8775435 0.0001552 -0.0000006 0.0001556 0.9768881 -0.0001075 -0.0000007 -0.0001885 0.0347247 1.3965797 0.3865105 -0.0000907 0.444561 0.5052871 -0.0000463 -0.000181 -0.0000038 0.064734 1.3964363 -0.386662 0.0000919 -0.4447175 0.5054459 -0.0000452 0.0001812 -0.0000033 0.0647348 0.5844106 0.0000011 0.0000007 0.0000017 0.6369413 -0.0000331 0.0000009 0.0000621 -0.007468 0.0810796 -0.0000086 0. -0.0000081 -0.0146245 0.0000062 -0.0000001 -0.0000644 0.1405547 unknown
polarizability: 112.4611524|-0.0009094|104.3423643|0.0000524|-0.0051236|30.6329059 unknown
InChI: InChI=1S/C4HCl3N2/c5-2-3(6)8-1-9-4(2)7/h1H
charge 0 multiplicity 1
10 atoms
Cl -0.000217 -2.52223 0.000165
Cl -2.798391 -0.801795 0.000196
Cl 2.798238 -0.802283 0.000199
N  -1.209186 1.375134 0.000007
N  1.20941 1.374925 0.000011
C  -0.000069 -0.732311 -0.000143
C  -1.20262 0.025742 -0.000069
C  1.202613 0.025538 -0.000066
C  0.000164 1.997645 -0.000104
H  0.000259 3.089232 0.000003
