program: Gaussian 09
title: 000249012
version: EM64L-G09RevD.01
frameworkgroup: C1[X(C7H7Cl3N2)]
method: RPBEPBE
basis: SDD
operation: Freq
keyword: #p
keyword: freq=noraman
keyword: PBEPBE/SDD
title: #p freq=noraman PBEPBE/SDD
converged: NO YES NO NO
title: Mulliken charges:
elementType: Cl Cl Cl N N C C C C C C C H H H H H H H
charge: 0.019593 0.019597 0.049750 0.158050 0.158052 -0.475915 -0.356566 0.614765 -0.681470 -0.350061 -0.350058 -0.369732 0.228966 0.228965 0.221808 0.221813 0.216558 0.216556 0.229332
chargesum: 0.00000
title: Mulliken charges with hydrogens summed into heavy atoms:
elementType: Cl Cl Cl N N C C C C C C C
charge: 0.019593 0.019597 0.049750 0.158050 0.158052 -0.017984 0.087055 0.614765 -0.019025 -0.350061 -0.350058 -0.369732
polarizability: 1.65827190e+02 2.19305030e-04 1.33000700e+02 -7.50230344e+00 6.36930567e-05 6.15299101e+01
1716.lowfreq: -8.9416 -1.3536 0.0012 0.0013 0.0021 5.4433 42.5974 46.6914 88.0107
frequency: 42.5966 46.5754 88.0017 117.7911 159.0701 191.4202 195.1551 199.9052 227.5137 280.7050 303.1571 345.9177 376.0396 409.8916 459.3430 517.5726 572.7944 637.2715 706.8179 723.1856 754.9257 770.5678 802.0234 872.7794 887.4957 1046.6566 1072.6419 1077.1963 1088.5849 1189.6062 1212.0216 1248.6070 1274.8590 1281.0466 1295.9010 1329.2697 1337.8432 1393.6628 1440.5732 1462.0659 1474.6553 1478.4606 1485.3326 1524.6824 2981.2279 2992.9852 3012.4282 3040.3092 3072.1860 3083.5768 3085.1125
redmass: 7.3270 4.2498 1.5882 7.8352 7.1697 21.7335 14.6555 14.2477 1.1836 3.9427 2.6499 29.0618 5.8114 13.7822 8.7479 5.6365 12.3910 9.4768 6.5957 2.3611 1.6610 11.6686 10.1314 1.2885 2.0362 3.6711 5.3743 1.5483 2.0874 11.9385 2.1558 4.2163 2.3097 1.3026 1.3457 5.2296 1.6111 1.2089 7.1531 1.1092 1.0554 1.0459 1.0780 10.2739 1.0357 1.0596 1.0594 1.1011 1.1019 1.0992 1.1030
irintensity: 0.2557 0.0074 0.0708 0.5933 0.6299 0.0258 0.0077 0.3086 0.1264 0.4236 1.0903 0.5979 3.5683 6.9169 10.3437 0.1016 0.0055 2.4543 32.0907 35.5199 75.5466 25.7924 77.4642 10.1647 3.3874 7.3733 25.0972 60.2592 37.1814 50.1417 29.6796 11.9751 0.1420 3.2944 1.1875 303.4846 56.0747 9.1869 330.8952 15.3804 3.3113 6.4435 20.4810 195.5213 34.3102 10.0304 25.3738 1.0660 4.4042 37.2239 47.1420
temp: 298.150 k
press: 1.00000 atm
elementType: 17 17 17 7 7 6 6 6 6 6 6 6 1 1 1 1 1 1 1
symmnumber: 1
zpe: 338961.9 jmol-1
zpe.correction: 0.129104 hartree
zpe.thermalcorrener: 0.141424 hartree
zpe.thermalcorrenthalpy: 0.142368 hartree
zpe.thermalcorrgfe: 0.088611 hartree
zpe.sumelectzpe: -1759.723237 hartree
zpe.sumelectthermal: -1759.710917 hartree
zpe.sumelectthermalent: -1759.709973 hartree
zpe.sumelectthermalfe: -1759.763730 hartree
dipole: 3.8449 0.0001 -0.2451
dipole: 3.8527
quadrupole: -91.1359 -98.7471 -89.6169
quadrupole: 0.0002 0.5352 -0.0001
quadrupole: 2.0307 -5.5805 3.5497 0.0002 0.5352 -0.0001
hfenergy: -1759.8523407 hartree
pointgroup: C01 [X(C7H7Cl3N2)]
dipole: -1.5085916 0.0000262 -0.1471931 debye
dipolederiv: -0.2686296 -0.2944015 -0.0377118 -0.3158601 -0.7148613 -0.069611 -0.0294952 -0.0590424 -0.0633347 -0.2686983 0.2944918 -0.0373709 0.3159448 -0.7149384 0.0688388 -0.029119 0.058266 -0.0631835 -0.9334564 0.0000402 -0.1431134 0.0000502 -0.0762834 -0.0000137 -0.1644163 -0.0000139 -0.066594 -1.206415 -0.2778868 -0.1949661 -0.3996607 -0.606196 -0.0710241 -0.2136563 -0.0474388 -0.119239 -1.2064801 0.2780451 -0.1946411 0.3998498 -0.6062646 0.0704307 -0.213199 0.0468402 -0.1191023 -0.2377222 -0.0000301 0.0481705 -0.000101 0.0981266 0.0000253 0.2482571 0.0000408 0.0313332 0.0798705 0.0000206 -0.0467808 0.0001359 0.1464026 0.0000114 -0.2813013 -0.0000027 0.1168367 0.2182912 0.0000762 -0.0419641 0.0000456 -0.9670641 -0.0006063 0.025848 -0.0006011 0.0534973 -0.0641024 -0.0000057 0.0062848 -0.000071 0.1004548 0.000036 0.123054 0.000036 0.0437067 0.8333111 0.2959384 0.1642325 0.4730326 1.4067171 0.0966172 0.1385224 0.0496574 0.0392634 0.8333916 -0.2961817 0.1638867 -0.4732716 1.4067939 -0.0949917 0.1379747 -0.048027 0.0390894 2.0677924 -0.0001323 0.3515806 -0.000143 0.6921712 0.0003662 0.3712806 0.0003673 0.1034057 0.0426855 0.0130837 -0.0154363 0.0442205 -0.0102357 0.111006 -0.0233468 0.0516989 0.0270709 0.0426993 -0.0130646 -0.0154327 -0.0442139 -0.0100707 -0.1110365 -0.0233824 -0.0517335 0.0269088 0.0166265 0.0705697 -0.0335852 0.0424559 -0.049418 0.1185571 -0.0265429 0.0627725 -0.0016007 0.0166358 -0.0705306 -0.0336642 -0.0424268 -0.049224 -0.118604 -0.0266002 -0.0628176 -0.0017815 0.0523265 0.0135935 -0.0229607 0.0765301 -0.0749005 0.1144041 -0.0752436 0.1103982 0.0203473 0.052335 -0.0135617 -0.0229714 -0.0764374 -0.0746431 -0.1145172 -0.0753324 -0.1105142 0.0200826 -0.0704615 -0.0000641 0.1064435 -0.00008 0.1034336 0.000112 0.1366987 0.0001138 -0.0867064 unknown
polarizability: 165.2054759|-0.005692|133.0006748|10.9882268|0.042316|62.1516499 unknown
InChI: InChI=1S/C7H7Cl3N2/c1-2-3-4-5(8)11-7(10)12-6(4)9/h2-3H2,1H3
charge 0 multiplicity 1
19 atoms
Cl -0.441053 -2.802523 -0.332009
Cl -0.441355 2.801852 -0.32872
Cl 4.055209 -0.000574 0.497965
N  1.68605 -1.204272 0.057478
N  1.685918 1.203378 0.058891
C  -1.906162 -0.000255 -0.601226
C  -2.729195 -0.000934 0.722019
C  -0.419566 -0.000324 -0.347073
C  -4.246553 -0.000796 0.445584
C  0.363868 -1.180194 -0.192051
C  0.36374 1.179447 -0.190684
C  2.28598 -0.000477 0.169438
H  -2.178914 0.892593 -1.192118
H  -2.178849 -0.892546 -1.192985
H  -2.45516 -0.890957 1.319878
H  -2.455163 0.888472 1.320795
H  -4.547953 0.893482 -0.130676
H  -4.547921 -0.894407 -0.131728
H  -4.818122 -0.001363 1.390724
