program: Gaussian 09
title: 000249013
version: EM64L-G09RevD.01
frameworkgroup: C1[X(C10H5Cl3N2)]
method: RPBEPBE
basis: SDD
operation: Freq
keyword: #p
keyword: freq=noraman
keyword: PBEPBE/SDD
title: #p freq=noraman PBEPBE/SDD
converged: NO YES NO YES
title: Mulliken charges:
elementType: Cl Cl Cl N N C C C C C C C C C C H H H H H
charge: 0.044533 0.044532 0.052102 0.154099 0.154097 0.306480 0.401035 -0.351056 -0.351062 -0.316671 -0.316670 -0.209112 -0.209111 -0.232575 -0.363197 0.243879 0.243879 0.234450 0.234451 0.235917
chargesum: 0.00000
title: Mulliken charges with hydrogens summed into heavy atoms:
elementType: Cl Cl Cl N N C C C C C C C C C C
charge: 0.044533 0.044532 0.052102 0.154099 0.154097 0.306480 0.401035 -0.107176 -0.107183 -0.316671 -0.316670 0.025338 0.025339 0.003343 -0.363197
polarizability: 2.18222413e+02 -6.41080726e-05 1.30949976e+02 7.37327475e-03 -1.45676698e-02 9.66942479e+01
1716.lowfreq: -23.0076 -6.3284 0.0012 0.0018 0.0026 1.4303 8.4800 35.3915 60.1690
frequency: -22.8762 35.3301 60.1661 113.2651 159.7545 177.0630 189.1259 190.1666 236.8545 257.2602 350.3716 395.9387 408.3738 436.3190 453.9876 487.4193 573.6817 574.1705 611.1527 656.2686 677.1522 701.1392 749.4382 773.9454 774.7853 790.5633 849.5337 922.2966 949.7769 975.2480 987.6867 999.7880 1028.8612 1081.0184 1153.3789 1175.8225 1189.2536 1195.7318 1218.4277 1253.5366 1312.8265 1347.8730 1371.8441 1421.7185 1430.1938 1478.8077 1526.3114 1586.0443 1611.8115 3130.0080 3135.0473 3145.4041 3156.0274 3170.1406
redmass: 4.1241 12.1649 7.5442 8.6277 9.2973 16.3513 22.1469 14.6371 5.3107 12.1618 33.4994 2.8089 12.5025 8.3819 5.9546 12.7618 5.0208 12.3749 6.5944 11.2180 7.2775 1.7856 3.7492 2.8784 11.8166 12.6110 1.2466 1.3837 9.2052 1.3895 6.2856 1.3204 2.1372 1.6028 5.9946 1.0529 1.2026 5.8829 12.0788 12.5874 1.3566 5.4955 7.1700 12.2752 2.1982 2.6335 9.4401 6.0209 6.1942 1.0850 1.0882 1.0928 1.0970 1.1019
irintensity: 0.0000 0.0415 0.3841 0.2144 0.3304 0.3323 0.0177 0.0000 0.0021 0.5428 0.0535 0.0000 3.2443 0.1337 4.3771 22.7270 9.0304 0.0017 0.0789 0.8824 4.9212 41.9516 167.5409 6.5622 0.2762 124.8071 0.0000 0.4242 0.0070 0.0000 3.2845 0.0062 14.8874 8.3124 26.0585 0.0085 17.4281 110.2947 82.1914 0.5003 0.4400 366.5091 0.1478 360.0071 10.3825 36.0336 195.9424 1.2735 2.0332 1.0168 0.0027 12.7730 27.8478 18.2245
temp: 298.150 k
press: 1.00000 atm
elementType: 17 17 17 7 7 6 6 6 6 6 6 6 6 6 6 1 1 1 1 1
symmnumber: 1
zpe: 326808.5 jmol-1
zpe.correction: 0.124475 hartree
zpe.thermalcorrener: 0.136515 hartree
zpe.thermalcorrenthalpy: 0.137459 hartree
zpe.thermalcorrgfe: 0.084315 hartree
zpe.sumelectzpe: -1872.691668 hartree
zpe.sumelectthermal: -1872.679628 hartree
zpe.sumelectthermalent: -1872.678684 hartree
zpe.sumelectthermalfe: -1872.731827 hartree
dipole: 4.0592 0.0000 0.0004
dipole: 4.0592
quadrupole: -102.2237 -116.3994 -98.4770
quadrupole: 0.0000 -0.0007 -0.0042
quadrupole: 3.4764 -10.6994 7.2230 0.0000 -0.0007 -0.0042
hfenergy: -1872.8161427 hartree
pointgroup: C01 [X(C10H5Cl3N2)]
dipole: -1.5970179 -0.0000451 -0.000148 debye
dipolederiv: -0.2488295 0.2889258 -0.0000404 0.2985477 -0.7143372 0.0000682 -0.0000651 0.0000702 -0.036278 -0.2487949 -0.2888979 -0.000007 -0.2985202 -0.7143711 -0.0000181 -0.0000481 -0.0000414 -0.0362781 -1.0096069 -0.0000281 0.0000227 -0.0000277 -0.0761979 0.0000013 0.0003657 0.000001 -0.0386387 -1.3659748 0.31484 -0.0000852 0.4125802 -0.6344081 -0.000052 -0.0000441 0.0001181 -0.095051 -1.3659287 -0.3148838 -0.0000485 -0.4126226 -0.6344491 0.00008 -0.0000203 -0.0001183 -0.0950515 0.1468002 0.0000034 0.0000092 0.0000007 -0.0141931 0.0000297 0.0000476 -0.0000047 0.0211457 0.2465009 0.0000366 0.0000321 0.0000377 -0.9426783 0.0000011 0.0000048 0.0000055 0.0553199 -0.1393497 -0.0000302 -0.0929287 0.0001054 -0.0872884 0.0000703 0.0664202 0.0000539 0.052082 -0.1393773 0.0000297 0.092884 -0.0001044 -0.0872937 0.0000811 -0.0664912 0.0000521 0.0520937 0.8965444 -0.3267062 0.0001472 -0.3697376 1.4288057 -0.0001178 0.0000852 -0.0001094 0.0228203 0.8965002 0.3266746 0.0000823 0.3697057 1.4288447 0.000004 0.000121 0.000061 0.0228201 -0.0266641 0.0000418 0.112673 0.0000178 -0.1350822 0.0000909 0.065078 0.0000996 0.0719238 -0.0266077 -0.0000344 -0.1126993 -0.0000102 -0.1350833 0.0000827 -0.0650974 0.0000943 0.0718739 0.1191285 0.000009 0.0000253 0.0000092 -0.1472853 0.0000409 0.0000214 0.0000333 -0.0448182 2.2691403 0.0000453 -0.0000762 0.0000449 0.7439763 -0.0000099 -0.0003841 -0.0000058 0.0469078 0.0534764 0.0000365 0.0911644 0.0000307 0.1304361 -0.0000682 0.0874072 -0.0000529 -0.0238148 0.0535295 -0.0000429 -0.0911454 -0.0000373 0.1304378 -0.0000775 -0.0873865 -0.0000596 -0.0238643 0.0087647 -0.0000357 -0.0802253 -0.0000563 0.1507274 -0.0000921 -0.0954073 -0.000088 -0.0570936 0.0087141 0.0000263 0.080246 0.0000457 0.1507282 -0.0000866 0.0954245 -0.0000818 -0.057045 -0.1279657 -0.0000098 -0.0000303 -0.0000093 0.1587116 -0.0000278 -0.0000315 -0.0000273 0.0909459 unknown
polarizability: 218.2224125|0.0028897|130.9499761|0.0073728|0.0145679|96.6942479 unknown
InChI: InChI=1S/C10H5Cl3N2/c11-8-7(6-4-2-1-3-5-6)9(12)15-10(13)14-8/h1-5H
charge 0 multiplicity 1
20 atoms
Cl 0.278369 2.795561 -0.000016
Cl 0.278535 -2.795469 0.000077
Cl 4.852202 0.000183 0.000152
N  2.445774 1.205803 0.000382
N  2.445847 -1.205581 0.000396
C  -1.185199 0.0000 -0.000092
C  0.307014 0.000047 0.000123
C  -1.897645 -0.000541 -1.225826
C  -1.897993 0.00049 1.225443
C  1.097382 1.185341 0.000183
C  1.097453 -1.185199 0.000211
C  -3.309834 -0.000582 -1.223687
C  -3.310182 0.000438 1.222906
C  -4.019192 -0.000099 -0.000491
C  3.052358 0.00013 0.000646
H  -1.3506 -0.000919 -2.175203
H  -1.351217 0.000914 2.174974
H  -3.853896 -0.000995 -2.174347
H  -3.854512 0.000816 2.173413
H  -5.114662 -0.000137 -0.000647
