program: Gaussian 09
title: 000249006
version: EM64L-G09RevD.01
frameworkgroup: C1[X(C6H15NO)]
method: RPBEPBE
basis: SDD
operation: Freq
keyword: #p
keyword: freq=noraman
keyword: PBEPBE/SDD
title: #p freq=noraman PBEPBE/SDD
converged: YES YES NO NO
title: Mulliken charges:
elementType: O N C C C C C C H H H H H H H H H H H H H H H
charge: -0.431492 -0.574344 -0.388470 -0.129714 -0.337348 -0.353998 -0.353794 -0.696522 0.220584 0.180059 0.197120 0.176177 0.223711 0.192930 0.192790 0.206039 0.186027 0.258519 0.268348 0.211155 0.213317 0.208464 0.330442
chargesum: 0.00000
title: Mulliken charges with hydrogens summed into heavy atoms:
elementType: O N C C C C C C
charge: -0.101050 -0.047477 0.012173 0.067405 0.062541 0.031722 0.038272 -0.063586
polarizability: 8.71805897e+01 -1.00870833e+00 7.38471552e+01 7.05592501e-01 8.14149909e-01 6.84918816e+01
1716.lowfreq: -13.3489 -6.6730 -2.4474 -0.0005 0.0007 0.0007 53.6162 62.7038 116.0933
frequency: 53.6079 62.5332 116.0783 127.6913 142.0791 211.9469 225.5285 257.6665 284.3041 316.9841 363.9711 412.6241 478.1572 504.9021 581.4624 733.1487 784.4309 857.4590 888.4304 906.3961 943.0735 985.4756 1025.6405 1030.3328 1048.2849 1079.7099 1097.1666 1128.8463 1152.3701 1193.4751 1240.4519 1261.7357 1282.6875 1288.5035 1294.3606 1318.1212 1345.2791 1354.1385 1359.7152 1372.3598 1386.5099 1459.7217 1463.6739 1468.1478 1475.6274 1478.7644 1488.4323 1632.0881 2937.8680 2943.2653 2952.0921 2957.9890 2967.6378 2970.4578 3002.3860 3020.2300 3045.2294 3058.1621 3067.2467 3069.3740 3442.3311 3556.3644 3572.2979
redmass: 2.6640 1.9073 2.8399 2.5333 2.2364 3.0685 1.1239 1.0872 1.8900 1.5081 2.5194 2.6636 2.0587 3.1999 1.5163 1.0786 1.2285 2.2791 1.7494 1.2731 3.0907 1.8333 3.9204 1.4298 1.7729 2.2290 1.6553 1.8717 2.0416 1.6931 1.4024 1.3306 1.1014 1.1787 1.1394 1.3600 1.4097 1.5132 1.2867 1.4274 1.2218 1.0821 1.0814 1.0640 1.0427 1.0694 1.0860 1.0955 1.0717 1.0686 1.0732 1.0616 1.0628 1.0362 1.0965 1.0960 1.1010 1.0970 1.1005 1.0994 1.0443 1.0661 1.0977
irintensity: 0.0095 0.4430 1.4728 0.4778 5.3398 5.9795 0.3683 74.1256 37.2141 85.9615 31.4588 26.4480 2.0899 6.9493 238.4977 9.4962 0.0206 2.8906 4.6009 3.8242 91.7877 11.2838 0.2668 2.8688 2.6178 0.6519 15.6001 28.0329 1.1915 0.6172 7.1060 3.0867 1.2063 7.7849 0.2775 0.5024 8.1989 3.5160 17.5116 3.3309 12.5114 3.0134 3.4096 0.4655 12.3125 1.9206 18.9476 43.7896 47.3598 49.7020 22.3735 7.2390 108.0695 43.8481 10.7214 1.0570 37.5602 41.7058 94.8404 58.8366 1.9522 5.7353 0.3340
temp: 298.150 k
press: 1.00000 atm
elementType: 8 7 6 6 6 6 6 6 1 1 1 1 1 1 1 1 1 1 1 1 1 1 1
symmnumber: 1
zpe: 541471.9 jmol-1
zpe.correction: 0.206236 hartree
zpe.thermalcorrener: 0.217204 hartree
zpe.thermalcorrenthalpy: 0.218149 hartree
zpe.thermalcorrgfe: 0.169668 hartree
zpe.sumelectzpe: -366.899238 hartree
zpe.sumelectthermal: -366.888269 hartree
zpe.sumelectthermalent: -366.887325 hartree
zpe.sumelectthermalfe: -366.935806 hartree
dipole: -0.7565 1.4185 -0.7290
dipole: 1.7652
quadrupole: -53.2774 -54.5205 -47.8814
quadrupole: -7.5527 4.1590 4.4803
quadrupole: -1.3843 -2.6274 4.0117 -7.5527 4.1590 4.4803
hfenergy: -367.1054736 hartree
pointgroup: C01 [X(C6H15N1O1)]
dipole: 0.2955293 0.5942693 0.2045173 debye
dipolederiv: -0.7161239 0.1544242 -0.075987 0.1613817 -0.7635969 0.2405724 -0.0762729 0.2777074 -0.2130267 -0.6526086 0.240374 0.0839478 0.2066637 -0.714398 0.0618553 0.1013923 -0.0054258 -0.2132601 -0.1035999 -0.0350606 -0.0090577 -0.0063971 0.027753 -0.0231177 -0.037435 -0.0739367 0.1490893 0.2406412 0.0370471 -0.0410154 -0.0231888 0.4604432 -0.0525909 0.0215722 -0.103292 0.2514071 -0.0444154 -0.002225 0.0027119 -0.0638647 0.0809661 -0.0480685 -0.0136698 -0.0571744 0.1280889 0.0296799 -0.007392 0.0092787 0.0227414 0.1552485 -0.0348085 0.0346243 -0.0339365 0.1352533 0.3129572 -0.0130899 0.0567335 -0.0732802 0.5211032 -0.1397279 0.0585804 -0.1641118 0.3297656 -0.0803095 0.0168852 0.0366238 -0.0040788 0.0769351 -0.0176968 0.0125715 -0.0197032 0.0737366 0.0873931 0.0062816 0.01464 0.01636 -0.127476 0.0139261 0.0168819 0.0448032 0.0653276 0.0300888 -0.0133308 0.0112243 0.004069 0.0671798 0.0476656 0.0244754 0.0168189 -0.1987659 0.0419098 0.0214874 0.0071296 -0.0020161 0.0003445 0.0102663 -0.0105583 0.0209632 -0.2180483 0.0294616 -0.0057704 -0.0085166 -0.0035078 0.0584277 0.0451163 0.0031581 0.0262195 -0.202913 0.0818973 0.0387402 -0.0101741 0.0562603 -0.1320759 -0.0037433 -0.0152653 0.0195115 0.063149 0.0189863 0.0568907 0.0017467 0.0178642 -0.2068091 -0.0077037 -0.0040244 0.0228305 0.0685042 0.0280169 -0.0056407 0.0326163 -0.0048207 0.0632029 0.0541092 0.0019603 0.0218225 -0.2079148 0.0864208 0.0064679 -0.0241674 0.0210093 0.0332762 -0.0111996 0.0377516 0.0033056 -0.1551348 -0.1840904 -0.1090341 -0.0381015 -0.1317724 -0.1277339 -0.0001495 -0.0871208 -0.0395076 0.0347377 0.3115453 -0.0679689 0.0533494 -0.034537 0.1737614 -0.0598577 -0.0002989 0.0318034 -0.0085504 0.0911505 -0.2261948 -0.1035827 -0.1113929 0.173925 0.0252066 -0.0799477 0.0608635 0.175792 0.0731165 0.011399 0.0127682 0.0785498 -0.1804142 0.0153427 0.0141835 0.0310978 0.0803858 -0.1625527 -0.0889172 -0.0722543 -0.1135893 0.037163 -0.0569585 -0.1005066 -0.0593155 0.0418805 0.0751689 0.0157104 -0.0158497 0.0111051 0.0747566 0.0577987 0.0539914 0.0484886 -0.1824081 0.4052662 -0.0310833 0.0759362 -0.0235587 0.2480178 -0.1162367 0.0439566 -0.069832 0.0029045 unknown
polarizability: 87.1645482|1.1081987|73.4854856|0.7989058|-1.5529355|68.8695926 unknown
InChI: InChI=1S/C6H15NO/c1-2-3-4-6(7)5-8/h6,8H,2-5,7H2,1H3
charge 0 multiplicity 1
23 atoms
O  2.720069 -1.546013 0.433911
N  1.200622 1.903766 -0.257862
C  0.03685 -0.281476 -0.330512
C  1.24676 0.503853 0.220877
C  -1.314679 0.167013 0.264562
C  -2.525192 -0.539001 -0.387299
C  2.58841 -0.194548 -0.141751
C  -3.874421 -0.104475 0.225494
H  0.202351 -1.359563 -0.137097
H  0.013535 -0.160823 -1.436249
H  1.167113 0.535126 1.330321
H  -1.319628 -0.038644 1.356118
H  -1.409991 1.264378 0.151546
H  -2.409024 -1.637963 -0.287591
H  -2.527452 -0.325566 -1.476206
H  2.651375 -0.354082 -1.2334
H  3.43937 0.450932 0.171374
H  1.166261 1.984944 -1.280184
H  1.902252 2.526914 0.155072
H  -4.025283 0.986002 0.114502
H  -4.725962 -0.615943 -0.260307
H  -3.911509 -0.338251 1.306488
H  2.673173 -1.472878 1.421093
