program: Gaussian 09
title: 000249018
version: EM64L-G09RevD.01
frameworkgroup: C1[X(C6H13NO2S3)]
method: RPBEPBE
basis: SDD
operation: Freq
keyword: #p
keyword: freq=noraman
keyword: PBEPBE/SDD
title: #p freq=noraman PBEPBE/SDD
converged: YES YES NO NO
title: Mulliken charges:
elementType: S S S O O N C C C C C C H H H H H H H H H H H H H
charge: 0.863458 0.115563 0.127187 -0.528266 -0.553946 0.101650 -0.407002 -0.366424 -0.565083 -0.631542 -0.635127 -0.757377 0.285425 0.226094 0.248308 0.229668 0.205626 0.246901 0.248994 0.218171 0.246461 0.227702 0.278021 0.278603 0.296933
chargesum: 0.00000
title: Mulliken charges with hydrogens summed into heavy atoms:
elementType: S S S O O N C C C C C C
charge: 0.863458 0.115563 0.127187 -0.528266 -0.553946 0.101650 0.104517 0.111552 -0.565083 0.069979 0.057207 0.096180
polarizability: 2.83723340e+02 -3.02128865e+01 1.55100407e+02 8.45176946e+00 -4.44322601e+00 9.99111752e+01
1716.lowfreq: -9.4228 0.0013 0.0016 0.0017 6.7596 8.1347 31.8797 37.8951 72.2007
frequency: 31.8247 37.8877 72.1854 80.6592 92.6885 99.9582 107.5078 132.9122 142.2487 156.6531 164.4974 200.1607 211.7975 242.0012 258.5741 267.6547 303.1717 320.0797 360.4675 380.6973 397.8935 464.2186 550.8118 563.7055 585.2403 774.9742 779.5519 795.9075 838.5339 862.8984 882.6297 952.1595 960.0753 993.5482 1009.4532 1068.0327 1073.6638 1095.1463 1152.4726 1188.4038 1272.5629 1288.6384 1302.1900 1339.7463 1349.2716 1391.7729 1396.6265 1414.5872 1417.0600 1457.1847 1467.0478 1470.3793 1473.9703 1481.0551 1488.2167 1528.8268 2992.6234 2993.0411 2999.7044 3004.8297 3030.9296 3055.4397 3064.0910 3090.2593 3092.9954 3103.9247 3105.4133 3180.0875 3187.4746
redmass: 5.0979 5.1966 4.7919 3.7206 3.9544 3.3756 5.4902 5.3039 3.2418 2.0581 2.0528 1.4048 1.0404 4.1508 3.7557 2.9201 6.5036 3.3273 8.8081 5.6814 2.9494 5.0159 6.4972 4.1034 4.9401 1.3931 11.2570 1.2525 1.9040 5.3134 4.2760 2.0110 1.4238 1.4850 2.6137 2.3469 1.9000 1.8645 1.8479 2.8425 1.2358 1.2048 1.1319 1.2594 1.2875 1.2044 1.1963 1.0540 1.0551 1.2223 1.0457 1.0449 1.1527 1.0740 1.1745 1.9462 1.0356 1.0381 1.0602 1.0598 1.0243 1.1027 1.1033 1.0999 1.1007 1.1018 1.1004 1.1075 1.1077
irintensity: 4.5471 4.8153 3.5960 0.1283 3.7863 0.7963 0.9948 0.7425 0.3246 1.0543 0.2140 0.1621 0.8017 0.3916 38.6559 25.3230 31.2023 7.7929 30.8083 10.0617 9.2273 4.4416 32.3578 9.9793 1.7932 3.1944 67.8850 2.4408 24.1253 38.4042 14.8796 24.0418 24.6436 24.1185 6.6948 14.3171 10.8909 13.3349 20.6586 27.7216 41.9052 18.1284 6.0387 13.5787 25.3228 15.6481 21.5657 8.1243 14.5107 54.2706 20.4799 14.4180 25.5371 3.0113 88.2875 168.3034 21.7638 15.2554 14.8875 22.8837 0.2742 4.2432 6.0380 23.8602 15.1350 16.0381 23.8497 0.0789 0.4438
temp: 298.150 k
press: 1.00000 atm
elementType: 16 16 16 8 8 7 6 6 6 6 6 6 1 1 1 1 1 1 1 1 1 1 1 1 1
symmnumber: 1
zpe: 497005.9 jmol-1
zpe.correction: 0.189300 hartree
zpe.thermalcorrener: 0.206180 hartree
zpe.thermalcorrenthalpy: 0.207124 hartree
zpe.thermalcorrgfe: 0.143308 hartree
zpe.sumelectzpe: -1634.701738 hartree
zpe.sumelectthermal: -1634.684858 hartree
zpe.sumelectthermalent: -1634.683913 hartree
zpe.sumelectthermalfe: -1634.747730 hartree
dipole: -2.4784 -0.8116 1.7764
dipole: 3.1554
quadrupole: -85.6634 -97.3171 -101.6281
quadrupole: 20.5405 6.3865 3.7086
quadrupole: 9.2061 -2.4476 -6.7586 20.5405 6.3865 3.7086
hfenergy: -1634.8910377 hartree
pointgroup: C01 [X(C6H13N1O2S3)]
dipole: 0.7536739 -0.7459507 0.6455425 debye
dipolederiv: 1.2982169 -0.2280425 -0.104309 -0.3204968 1.2294309 0.0782107 -0.2692765 0.22958 0.9953088 -0.2133764 -0.1643485 -0.1934521 -0.276349 0.2461949 0.2035202 -0.2482432 0.2747227 0.025142 -0.6363009 0.5309913 0.2582353 0.1807583 -0.528806 -0.313713 -0.0709864 -0.2065577 -0.2779861 -0.6137208 0.1535972 0.0141531 0.2432138 -0.8476489 -0.0371653 0.0039919 0.0982751 -0.4388803 -0.6104525 0.0476357 0.055034 0.0987833 -0.5165032 -0.0328951 0.1981889 -0.3102379 -0.7532149 -1.0190517 0.030486 -0.3733525 -0.284508 -0.4459524 -0.1991997 -0.6204087 -0.095573 -0.5138282 0.0194827 0.0058918 0.0161751 0.1195766 0.3653343 0.0876048 0.1481436 0.088199 0.2723556 0.5588741 -0.0747303 0.1673363 -0.1719563 0.2445324 -0.0952758 0.0220691 -0.1299057 0.151711 1.3228357 -0.3432872 0.2362642 0.4473715 0.143078 0.4226597 0.9769202 0.0878541 0.3213324 0.1073549 -0.0132532 -0.0004982 -0.024758 -0.0810324 0.0129321 -0.0820747 0.0577237 -0.0453508 -0.0497911 -0.001625 -0.0473484 0.0131141 -0.0267789 0.0633075 0.0038674 0.0917035 0.0129145 -0.1994188 -0.00181 0.0101332 0.1223246 -0.1751166 -0.0475028 0.109847 -0.0703328 -0.0739598 -0.0030534 -0.0160075 0.0676654 -0.0751988 -0.0295775 -0.0517875 -0.0264533 -0.0188929 0.0707019 0.0188637 0.0342469 -0.1262514 -0.007445 0.038549 0.0400933 -0.1096897 0.0165309 -0.0526417 0.1183552 -0.0307737 -0.0581672 0.0864254 0.0381369 -0.0409 0.0233708 0.0192453 -0.0553433 -0.0430122 -0.0408797 -0.0356317 -0.113447 -0.0683418 0.0250985 -0.0842771 0.0168907 0.0914994 -0.1391825 -0.0824961 0.0523077 0.0232148 0.0855331 0.0131818 0.0621161 0.0261691 0.0843747 0.021194 0.0451597 -0.090514 0.0043345 0.0532825 -0.0053033 -0.0630282 -0.0062454 -0.0308078 0.0907764 0.0684659 0.0547911 -0.0261389 -0.0041032 -0.076865 0.0256338 -0.0730472 0.0127814 0.0998907 0.0194971 0.074163 0.0088617 0.0523747 -0.095408 0.0213705 -0.0221613 -0.0876121 0.0524766 -0.1145578 -0.0075121 -0.0925634 -0.012662 0.0072222 0.0084537 -0.0835204 0.0619968 -0.1625532 0.0903227 -0.0210519 0.100837 0.068719 0.0347228 -0.0192507 0.013258 0.0795248 0.0196459 -0.0038498 0.0026449 -0.0314297 0.1046818 -0.0095521 -0.0114531 -0.0129082 -0.0202005 0.0112918 0.0164758 0.0018932 -0.0107994 0.0002352 0.0506999 -0.0136659 0.0496224 0.0788362 -0.0493451 0.0728913 0.047292 -0.0137254 0.0664402 -0.0336859 0.0148344 -0.0403919 0.0913461 unknown
polarizability: 213.9606743|-74.5455633|192.9430503|-16.311859|47.5047792|131.8311972 unknown
InChI: InChI=1S/C5H10NS2.CH3O2S/c1-3-6(4-2)5(7)8;1-4(2)3/h3-4H2,1-2H3;1H3
charge 0 multiplicity 1
25 atoms
S  -2.108714 1.846456 0.191668
S  -1.017671 -0.271111 -1.109072
S  0.962021 -2.087118 -1.999439
O  -2.034899 3.262098 -0.636701
O  -1.691443 1.849307 1.788277
N  1.593287 -0.201631 -0.071229
C  1.255768 0.920389 0.851767
C  2.9995 -0.698474 -0.035916
C  0.701046 -0.761376 -0.908122
C  1.467678 2.304679 0.205915
C  3.202509 -1.795557 1.02804
C  -3.938912 1.273789 0.125017
H  0.21547 0.81037 1.209593
H  1.904307 0.806256 1.739109
H  3.248718 -1.085882 -1.040448
H  3.647339 0.173894 0.164258
H  2.520223 2.453447 -0.096757
H  0.825694 2.44051 -0.680986
H  1.19965 3.089282 0.934199
H  2.947446 -1.430927 2.039115
H  2.575724 -2.675097 0.803513
H  4.259677 -2.115998 1.037184
H  -4.207742 1.20808 -0.937993
H  -3.978176 0.302064 0.634923
H  -4.5075 2.051847 0.653788
