program: Gaussian 09
title: 000248999
version: EM64L-G09RevD.01
frameworkgroup: C1[X(C14H14O4)]
method: RPBEPBE
basis: SDD
operation: Freq
keyword: #pfreq=noraman
keyword: PBEPBE/SDD
title: #p freq=noraman PBEPBE/SDD
converged: YES YES NO NO
title: Mulliken charges:
elementType: O O O O C C C C C C C C C C C C C C H H H H H H H H H H H H H H
charge: -0.442608 -0.180769 -0.184264 -0.188392 0.176705 -0.301654 -0.266132 -0.290051 0.140707 0.087182 -0.228619 -0.210024 -0.795356 0.094267 0.141751 -0.732000 -0.240642 -0.265465 0.281704 0.309599 0.291166 0.250124 0.247520 0.245092 0.220706 0.246245 0.240244 0.215958 0.248379 0.358548 0.265200 0.264880
chargesum: 0.00000
title: Mulliken charges with hydrogens summed into heavy atoms:
elementType: O O O O C C C C C C C C C C C C C C
charge: -0.084059 -0.180769 -0.184264 -0.188392 0.176705 -0.019950 0.043467 0.001115 0.140707 0.087182 0.021505 0.037496 -0.083313 0.094267 0.141751 -0.027420 0.024558 -0.000585
polarizability: 1.64211518e+02 1.25524969e+00 1.72667534e+02 5.08695542e+00 -6.21829602e+00 1.16398559e+02
1716.lowfreq: -1.6976 -0.0009 -0.0005 0.0004 6.0921 15.7958 48.9320 64.6406 79.9072
frequency: 48.7184 64.6323 79.8668 128.8251 169.2365 177.8912 191.7671 204.0775 225.6150 245.0220 256.6085 283.1209 298.6003 307.3471 337.9635 354.9042 379.0007 398.7656 420.7715 452.2734 464.4641 477.7239 496.7156 525.0221 560.7762 609.9325 636.3690 655.9084 689.7461 704.9670 732.5649 764.5699 767.8670 805.3764 864.1488 867.1177 876.8377 897.0770 916.0310 929.0309 948.2480 971.9924 984.9988 1004.9081 1014.7326 1044.9503 1078.2238 1090.6898 1103.2589 1113.6264 1121.4835 1142.2137 1155.0818 1177.1254 1204.4474 1231.0181 1246.2757 1263.2322 1277.0180 1301.5677 1311.9630 1320.2675 1332.0616 1344.0055 1364.9697 1385.7310 1406.7400 1458.8316 1468.7389 1469.0855 1472.6595 1562.6733 1575.3248 1613.8176 1619.4944 1628.3414 2986.3504 2996.9349 3002.7835 3012.1641 3081.5017 3088.2156 3096.3689 3098.5766 3105.5918 3129.7964 3141.6012 3155.1807 3181.0797 3514.0329
redmass: 7.1212 6.1812 6.1600 5.3827 4.1179 1.9122 1.4325 3.2897 1.4038 3.6806 2.6961 6.2155 3.6672 4.1962 3.0826 3.7775 1.2732 6.2693 3.0013 8.6907 4.8258 4.3916 4.4377 4.3404 3.9228 4.2162 5.1563 2.4221 4.3764 3.6187 2.6724 4.8774 4.5056 2.7336 2.3524 2.2801 3.7512 2.8695 2.8982 2.3519 1.4777 2.0529 2.3979 2.3843 1.3315 2.7553 2.4326 1.3910 1.8835 2.0459 1.7395 1.6569 1.8473 1.5552 2.5627 2.1745 1.6401 1.6743 1.6238 1.5935 1.4912 1.7227 1.8737 1.7554 2.0903 1.2032 1.1995 1.0624 1.0515 1.0520 1.0593 11.1528 9.1346 6.8606 7.2624 10.4511 1.0357 1.0821 1.0364 1.0838 1.0985 1.0878 1.1006 1.1002 1.0993 1.0865 1.0889 1.0999 1.1028 1.0654
irintensity: 1.8865 9.2465 4.9407 3.0962 1.3058 0.1487 0.4957 3.7577 2.0611 3.2836 1.6853 1.2299 2.0746 21.0050 3.6166 9.8772 131.5360 9.2988 9.9800 8.5347 1.5928 5.3555 4.7547 1.1956 0.5755 1.2757 0.8127 7.8483 11.9756 5.5502 19.7394 6.0451 4.5590 20.7804 10.3279 20.8588 20.7983 15.3857 1.7433 12.8867 1.4071 11.9272 41.2631 10.9713 1.1851 90.4955 11.7257 6.5329 38.5534 2.3340 56.3984 4.8808 2.3675 6.0744 41.9742 9.2545 14.2547 21.8594 1.5851 27.3449 9.1048 1.7788 39.4473 0.5506 4.1788 20.6857 29.5491 14.2574 8.7470 12.2249 6.0995 57.8591 239.4015 15.1543 7.6328 143.3486 12.3906 7.1356 12.1766 9.3747 27.3133 5.3635 10.0351 13.2434 10.0341 0.2438 2.9559 10.7243 9.0761 12.2373
temp: 298.150 k
press: 1.00000 atm
elementType: 8 8 8 8 6 6 6 6 6 6 6 6 6 6 6 6 6 6 1 1 1 1 1 1 1 1 1 1 1 1 1 1
symmnumber: 1
zpe: 649974.4 jmol-1
zpe.correction: 0.247562 hartree
zpe.thermalcorrener: 0.263565 hartree
zpe.thermalcorrenthalpy: 0.264509 hartree
zpe.thermalcorrgfe: 0.205528 hartree
zpe.sumelectzpe: -841.421076 hartree
zpe.sumelectthermal: -841.405073 hartree
zpe.sumelectthermalent: -841.404129 hartree
zpe.sumelectthermalfe: -841.463110 hartree
dipole: 1.2152 -0.1815 0.3533
dipole: 1.2784
quadrupole: -105.0071 -124.4571 -99.5099
quadrupole: 0.8782 7.4667 6.3066
quadrupole: 4.6509 -14.7991 10.1482 0.8782 7.4667 6.3066
hfenergy: -841.668638 hartree
pointgroup: C01 [X(C14H14O4)]
dipole: 0.4788702 -0.0382086 0.1490068 debye
polarizability: 163.8694881|1.0045544|172.4457619|6.3203296|-7.331752|116.9623608 unknown
InChI: InChI=1S/C14H14O4/c1-13-6-5-7(14(2,18)12(13)17)10-8(15)3-4-9(16)11(10)13/h3-7,10-11,18H,1-2H3
charge 0 multiplicity 1
32 atoms
O  -3.115283 -1.338004 0.443297
O  -2.904282 1.484133 -0.186768
O  2.091484 2.434496 -1.087055
O  1.833789 -2.867893 0.09963
C  -0.50499 1.207399 0.40372
C  0.514101 0.613398 -0.699266
C  -0.710949 -1.442781 0.208159
C  0.525727 -0.947853 -0.633328
C  -2.001941 -0.791081 -0.352954
C  -1.900756 0.735871 -0.082482
C  -0.357605 0.428437 1.713984
C  -0.493612 -0.923104 1.623646
C  -0.438786 2.729909 0.573221
C  1.88206 1.287536 -0.588937
C  1.781161 -1.608814 -0.036261
C  -2.278389 -1.057998 -1.849526
C  2.978983 0.575714 0.112872
C  2.934446 -0.768369 0.362053
H  0.111852 0.944447 -1.676064
H  -0.780268 -2.540148 0.161668
H  0.441276 -1.355025 -1.659447
H  -0.207507 0.976851 2.649878
H  -0.439516 -1.602128 2.478223
H  -1.316759 3.076037 1.144886
H  0.476289 3.032952 1.109799
H  -0.442818 3.248138 -0.400034
H  -3.235554 -0.585342 -2.133368
H  -1.497173 -0.654655 -2.518326
H  -2.360115 -2.146545 -2.013453
H  -3.888422 -0.720866 0.339285
H  3.864175 1.179292 0.348787
H  3.771879 -1.300998 0.829458
