program: Gaussian 09
title: 000248976
version: EM64L-G09RevD.01
frameworkgroup: C1[X(C10H10N2O2)]
method: RPBEPBE
basis: SDD
operation: Freq
keyword: #p
keyword: freq=noraman
keyword: PBEPBE/SDD
title: #p freq=noraman PBEPBE/SDD
converged: NO YES NO NO
title: Mulliken charges:
elementType: O O N N C C C C C C C C C C H H H H H H H H H H
charge: -0.174049 -0.201033 -0.256511 -0.048885 0.158365 0.203998 0.100562 0.119215 -0.349897 -0.352833 -0.597300 -0.597354 -0.209361 -0.212523 0.269428 0.269232 0.235386 0.225577 0.239775 0.235371 0.239746 0.225652 0.238662 0.238776
chargesum: 0.00000
title: Mulliken charges with hydrogens summed into heavy atoms:
elementType: O O N N C C C C C C C C C C
charge: -0.174049 -0.201033 -0.256511 -0.048885 0.158365 0.203998 0.100562 0.119215 -0.080469 -0.083601 0.103438 0.103416 0.029302 0.026253
polarizability: 1.75629888e+02 -3.44150776e-01 1.36273486e+02 -1.67120883e-02 1.24739632e-02 6.67507115e+01
1716.lowfreq: -11.1214 -4.8554 -0.0007 -0.0007 -0.0005 3.0797 48.4305 66.5441 135.5237
frequency: 48.4201 66.5397 135.5234 142.9848 153.9339 191.6387 201.5383 207.5080 239.2524 283.1706 334.0830 358.4916 400.9811 453.6022 474.3549 481.2512 514.6347 571.9525 661.1596 679.7184 693.4200 710.2772 789.0419 793.9996 823.0083 858.4429 908.9844 972.6338 975.7700 1006.9434 1015.7815 1016.9771 1044.9591 1078.0557 1085.1254 1130.9290 1163.2913 1170.0829 1188.2169 1227.9149 1244.7745 1282.9695 1307.4514 1412.9948 1414.4276 1433.8753 1453.7267 1453.9038 1453.9878 1465.6330 1480.4605 1492.5645 1612.6809 1617.8417 1636.2504 1685.4684 2945.0488 2950.7714 3054.0644 3055.4928 3099.5223 3104.1523 3138.7744 3152.3884 3164.1137 3174.0246
redmass: 2.9703 4.2957 5.1546 3.1448 7.1973 4.4119 1.1281 1.0787 6.8752 3.3924 6.5113 4.1807 3.0762 4.8414 3.8068 4.3359 7.4622 10.4135 4.8004 6.8191 7.6167 3.0616 4.6522 1.6942 5.7556 7.8771 1.4014 3.6502 1.4102 1.3463 2.0139 1.6524 6.3554 3.1005 1.2242 1.4886 1.3780 1.9860 1.6915 3.6997 2.7216 1.5025 7.6422 1.1356 6.1009 1.1749 2.6640 1.0482 2.5179 1.0712 1.0492 1.0553 7.6705 7.6499 11.5999 12.5169 1.0428 1.0430 1.0904 1.0900 1.1012 1.1015 1.0864 1.0905 1.0956 1.1004
irintensity: 0.6952 3.8092 0.2548 6.5368 3.5597 0.0119 0.8561 0.2234 1.5584 7.1609 6.7071 5.5904 1.8702 0.0008 4.0326 0.0079 9.2162 3.1488 0.1023 5.7234 4.5662 83.0505 2.7686 30.5329 3.8102 33.7840 0.0068 77.1869 2.2156 0.0023 3.5723 14.9888 73.9664 0.5384 1.8263 4.9908 26.6120 2.2022 14.5814 1.9639 32.1865 0.4484 138.2665 5.0277 8.0894 2.1942 3.8849 10.1196 7.8324 34.5728 4.2234 19.7539 3.0460 42.5216 352.3989 68.8160 51.9908 64.0153 4.7142 47.6542 12.9686 39.1186 1.7924 5.1761 6.1704 21.6618
temp: 298.150 k
press: 1.00000 atm
elementType: 8 8 7 7 6 6 6 6 6 6 6 6 6 6 1 1 1 1 1 1 1 1 1 1
symmnumber: 1
zpe: 481747.9 jmol-1
zpe.correction: 0.183488 hartree
zpe.thermalcorrener: 0.196007 hartree
zpe.thermalcorrenthalpy: 0.196951 hartree
zpe.thermalcorrgfe: 0.144604 hartree
zpe.sumelectzpe: -645.993133 hartree
zpe.sumelectthermal: -645.980614 hartree
zpe.sumelectthermalent: -645.979670 hartree
zpe.sumelectthermalfe: -646.032017 hartree
dipole: -2.3199 -1.2083 -0.0002
dipole: 2.6157
quadrupole: -60.9006 -93.2004 -79.9299
quadrupole: -1.3084 -0.0036 -0.0142
quadrupole: 17.1097 -15.1901 -1.9196 -1.3084 -0.0036 -0.0142
hfenergy: -646.1766208 hartree
pointgroup: C01 [X(C10H10N2O2)]
dipole: 0.9177629 -0.4655492 -0.0050215 debye
dipolederiv: -0.5231125 0.1827007 0.0023845 0.0809339 -1.0433987 -0.0097083 0.0010217 -0.0073837 -0.3071842 -0.6616145 -0.2625256 -0.0031994 -0.177285 -0.9702051 -0.0075922 -0.0018819 -0.0077517 -0.3228137 -0.4854633 -0.0791729 -0.0004483 0.0745668 -1.0265109 -0.008905 0.0004261 -0.009473 -0.2759575 -0.0038993 -0.0565681 -0.000346 -0.1610764 -0.4075958 -0.0017857 -0.0014402 -0.0019471 -0.2644718 -0.3805236 0.169947 0.0016374 0.1713637 -0.1054148 -0.0012155 0.0022689 -0.0009211 -0.0013751 -0.4936883 -0.1643778 -0.0020746 -0.1059693 -0.0590557 -0.0003219 -0.0004579 -0.0007384 -0.0219334 1.1747501 0.0830941 0.0012278 0.1822849 1.5029633 0.0164842 0.0014806 0.0148345 0.2199418 1.1406422 0.0216335 0.0003288 -0.0155903 1.3842813 0.0132566 -0.0005689 0.0133434 0.2335183 -0.1180378 -0.0488047 -0.0006406 0.1163682 0.1358897 0.0028368 0.0015772 0.0026761 -0.0966198 -0.0998443 0.1032366 0.0012236 -0.0947848 0.1295312 0.0026552 -0.0011 0.0027434 -0.0976023 0.0780389 0.0185596 -0.1506524 0.0410362 0.2732815 -0.0630704 -0.2579636 -0.0812406 0.270208 0.0771315 0.0151468 0.1508244 0.0362693 0.2700379 0.0631603 0.2586255 0.0814143 0.2741799 0.1375547 0.0903967 0.0010534 0.055617 -0.0382149 0.001179 0.000583 0.0011829 -0.1421934 0.105168 -0.1264721 -0.0015044 -0.0850988 -0.0357997 0.0012224 -0.0010732 0.0012194 -0.1416877 0.1021264 0.0151799 0.0001755 -0.0320136 -0.02699 -0.0022201 -0.0002872 -0.0022514 0.1578387 0.1028239 -0.0324142 -0.0003891 0.0133722 -0.0287985 -0.0022011 0.0000315 -0.0022618 0.1571969 0.0925546 0.0393091 0.0321657 -0.0608705 -0.1529938 0.1150125 0.0439777 -0.0039753 0.0083958 -0.1881524 0.0457232 0.0374476 0.0591659 0.0852582 0.0245383 0.0040997 0.0233725 0.0916564 0.0925372 -0.0569646 -0.103927 -0.0566884 0.0411164 -0.0667346 -0.0564964 -0.0425348 -0.0779631 0.0927454 0.0396231 -0.0313464 -0.0599269 -0.1506281 -0.1184208 -0.0451287 0.0006917 0.0058447 0.0919268 -0.0592905 0.1032773 -0.0582195 0.0389513 0.068825 0.0559095 0.0448378 -0.0749989 -0.187909 0.0468841 -0.037338 0.059667 0.0860632 -0.0244513 -0.0038306 -0.0233607 0.0905386 -0.0827186 -0.0701538 -0.0008542 -0.074692 0.0607897 -0.0011271 -0.0008885 -0.0010644 0.1572533 -0.063036 0.0853096 0.0009745 0.0915702 0.0374422 -0.0014164 0.0011156 -0.001412 0.1582284 unknown
polarizability: 175.6179704|0.7655042|136.2757193|0.0500131|0.8200916|66.7603956 unknown
InChI: InChI=1S/C10H10N2O2/c1-11(2)12-9(13)7-5-3-4-6-8(7)10(12)14/h3-6H,1-2H3
charge 0 multiplicity 1
24 atoms
O  -0.682329 2.457964 0.02715
O  -1.02954 -2.26454 -0.027624
N  -1.222256 0.118763 -0.000257
N  -2.629716 0.255818 -0.000607
C  1.04183 0.669914 0.00773
C  0.944874 -0.743526 -0.009137
C  -0.338537 1.256993 0.015605
C  -0.502671 -1.124103 -0.01435
C  2.287597 1.315498 0.015197
C  2.08885 -1.556459 -0.018573
C  -3.25566 -0.243714 1.248661
C  -3.252763 -0.216217 -1.261996
C  3.45063 0.502503 0.005643
C  3.35301 -0.912342 -0.010948
H  2.349827 2.408191 0.028254
H  1.999453 -2.647213 -0.03153
H  -3.192078 -1.346614 1.364398
H  -4.317976 0.055745 1.235531
H  -2.774087 0.243208 2.112621
H  -3.190726 -1.316517 -1.400903
H  -2.767737 0.287954 -2.114049
H  -4.314596 0.084836 -1.24573
H  4.440257 0.971869 0.011232
H  4.268544 -1.513509 -0.018016
