program: Gaussian 09
title: 000248985
version: EM64L-G09RevD.01
frameworkgroup: C1[X(C10H11Cl5N2)]
method: RPBEPBE
basis: SDD
operation: Freq
keyword: #p
keyword: freq=noraman
keyword: PBEPBE/SDD
title: #p freq=noraman PBEPBE/SDD
converged: YES YES NO NO
title: Mulliken charges:
elementType: Cl Cl Cl Cl Cl N N C C C C C C C C C C H H H H H H H H H H H
charge: 0.009088 0.000675 0.039259 0.037152 0.041737 -0.142622 -0.433000 -0.379933 -0.393157 0.840913 -0.603893 -0.614782 -0.344104 -0.393095 -0.061638 -0.059363 -0.153014 0.203520 0.231350 0.237004 0.246977 0.358404 0.227885 0.231796 0.198264 0.231208 0.199265 0.244104
chargesum: 0.00000
title: Mulliken charges with hydrogens summed into heavy atoms:
elementType: Cl Cl Cl Cl Cl N N C C C C C C C C C C
charge: 0.009088 0.000675 0.039259 0.037152 0.041737 -0.142622 -0.074596 0.054937 0.090824 0.840913 0.054051 0.059796 -0.344104 -0.393095 -0.061638 -0.059363 -0.153014
polarizability: 2.52856998e+02 -1.61750559e+00 2.02669298e+02 2.78379282e+00 5.54273205e-01 8.82922936e+01
1716.lowfreq: -6.0793 0.0008 0.0014 0.0030 2.8626 8.7782 21.3889 31.4736 48.7929
frequency: 21.2176 31.3864 48.7128 63.2743 69.8726 80.0681 105.4561 140.0517 170.4881 203.5089 205.2063 212.3372 218.9544 221.3690 223.5178 262.8546 289.3781 298.2660 313.9246 317.3444 328.5012 342.6624 356.2250 371.7526 406.7702 457.7209 563.1137 565.0591 610.9242 618.9937 655.2722 719.9416 751.8548 761.0803 771.9977 808.6625 859.9002 956.8916 960.7275 1038.5224 1050.8245 1054.1124 1057.9867 1091.0354 1116.6001 1149.0647 1177.4677 1223.6759 1260.6429 1268.0180 1279.8227 1292.7109 1337.0740 1362.2204 1369.5591 1415.3314 1423.3515 1444.0400 1462.6687 1464.9117 1474.8398 1476.7906 1486.3934 1487.5928 1490.8789 1512.6752 1579.1858 2883.9393 2887.1616 2899.5716 2986.0648 3030.6470 3036.1371 3038.5210 3067.3032 3086.5556 3091.4304 3323.6527
redmass: 4.9476 3.7105 4.0421 15.4260 5.4961 11.0641 4.7693 7.4667 7.4500 19.0703 13.3960 4.0570 1.4649 1.4914 10.3030 1.8208 4.1288 11.4352 8.4492 11.5159 10.3270 6.3490 15.0882 2.1275 2.2602 5.1072 11.0439 3.5324 13.2892 11.3886 8.8422 3.5467 7.4381 3.5329 1.3387 8.7646 2.4424 4.5394 2.3876 1.5534 2.2083 5.1513 1.8653 1.2961 2.8559 1.8841 1.6455 1.4420 2.6213 2.7049 2.5775 2.8330 1.5145 1.3886 9.7486 1.6749 1.1772 1.1948 1.0544 1.0920 1.2600 1.0698 2.1243 1.1366 1.2008 3.4787 10.5550 1.0542 1.0618 1.0613 1.0665 1.0767 1.0863 1.0800 1.0983 1.1013 1.1011 1.0756
irintensity: 0.8014 0.5595 0.1702 0.0971 0.3124 0.2434 2.5927 0.1874 1.0548 0.0210 0.1547 0.0766 0.0043 1.3746 0.4240 1.1739 1.6007 1.7707 1.2264 2.0290 3.1756 21.8709 1.1453 3.7367 0.2487 21.6878 1.2453 6.7496 31.6276 1.2956 21.8428 56.3643 12.7772 13.5563 66.5389 4.1847 5.9807 15.1557 17.7946 18.0260 9.7717 25.6594 32.6768 8.2884 20.9289 7.8860 4.3200 63.8768 31.4150 12.0695 35.5099 77.3280 41.3564 4.4444 12.2189 13.3518 8.4087 6.6956 11.2641 12.8852 76.3279 25.2117 281.4879 63.3785 6.0071 114.0552 345.1720 57.0680 60.0816 271.0646 58.8926 27.1194 25.4980 29.3312 27.0924 24.2830 36.9296 395.8449
temp: 298.150 k
press: 1.00000 atm
elementType: 17 17 17 17 17 7 7 6 6 6 6 6 6 6 6 6 6 1 1 1 1 1 1 1 1 1 1 1
symmnumber: 1
zpe: 511668.1 jmol-1
zpe.correction: 0.194884 hartree
zpe.thermalcorrener: 0.213827 hartree
zpe.thermalcorrenthalpy: 0.214771 hartree
zpe.thermalcorrgfe: 0.145086 hartree
zpe.sumelectzpe: -2796.136809 hartree
zpe.sumelectthermal: -2796.117866 hartree
zpe.sumelectthermalent: -2796.116922 hartree
zpe.sumelectthermalfe: -2796.186607 hartree
dipole: 6.3134 -0.6663 -0.6852
dipole: 6.3853
quadrupole: -120.3250 -138.7011 -133.9507
quadrupole: -1.6694 -1.3443 0.5682
quadrupole: 10.6673 -7.7089 -2.9584 -1.6694 -1.3443 0.5682
hfenergy: -2796.3316929 hartree
pointgroup: C01 [X(C10H11Cl5N2)]
dipole: -2.4998301 0.2426057 0.0545011 debye
polarizability: 249.6140047|-0.2723983|202.4549105|-23.1479939|4.6598499|91.7496741 unknown
InChI: InChI=1S/C10H11Cl5N2/c1-17(2)4-3-16-10-8(14)6(12)5(11)7(13)9(10)15/h16H,3-4H2,1-2H3
charge 0 multiplicity 1
28 atoms
Cl 0.518136 2.937679 0.312345
Cl -0.38218 -2.578344 0.066353
Cl 2.752303 -3.041478 -0.427995
Cl 3.568204 2.456747 -0.430333
Cl 4.736001 -0.521533 -0.762735
N  -3.85452 -0.305381 0.467817
N  -1.204664 0.280601 0.225601
C  -3.471228 0.741828 -0.511641
C  -2.110082 1.382679 -0.135228
C  0.153622 0.158903 0.030057
C  -4.828671 -1.27831 -0.072849
C  -4.276476 0.244768 1.7763
C  1.083256 1.24772 -0.04739
C  0.735361 -1.153113 -0.077175
C  2.106818 -1.364524 -0.294413
C  2.456665 1.042489 -0.302512
C  2.984047 -0.262178 -0.43466
H  -4.237793 1.548841 -0.604536
H  -3.374898 0.252765 -1.498508
H  -2.231552 2.102904 0.696534
H  -1.727338 1.948744 -1.001605
H  -1.750385 -0.565485 0.466531
H  -4.989218 -2.085791 0.663112
H  -4.428994 -1.732477 -0.996294
H  -5.821391 -0.823101 -0.307257
H  -4.460856 -0.584857 2.480644
H  -5.207137 0.858724 1.706271
H  -3.477028 0.875178 2.201568
