program: Gaussian 09
title: 000248966
version: EM64L-G09RevD.01
frameworkgroup: C1[X(C5H5N3O3)]
method: RPBEPBE
basis: SDD
operation: Freq
keyword: #pfreq=noraman
keyword: PBEPBE/SDD
title: #p freq=noraman PBEPBE/SDD
converged: NO YES NO NO
title: Mulliken charges:
elementType: O O O N N N C C C C C H H H H H
charge: -0.228637 -0.236607 -0.270250 -0.420077 -0.390899 -0.603870 0.303715 -0.337245 0.142495 0.180252 0.181139 0.384095 0.234366 0.367703 0.355645 0.338175
chargesum: 0.00000
title: Mulliken charges with hydrogens summed into heavy atoms:
elementType: O O O N N N C C C C C
charge: -0.228637 -0.236607 -0.270250 -0.035981 -0.023196 0.089950 0.303715 -0.102879 0.142495 0.180252 0.181139
polarizability: 1.05619455e+02 3.70934423e+00 1.11149396e+02 -5.62993177e-04 -1.71253809e-02 3.50265932e+01
1716.lowfreq: -6.9487 -5.5550 -0.0009 -0.0007 -0.0003 5.5953 41.2643 130.9852 168.7117
frequency: 41.1547 130.9817 168.7116 170.5720 179.2300 320.7424 386.3720 406.7591 448.2561 506.6778 509.7115 533.3256 592.9907 617.9832 627.6420 671.4029 693.4287 749.1187 772.3260 801.8927 826.1906 892.5084 973.5669 990.2389 1062.6651 1108.7354 1204.8436 1292.6876 1342.1536 1364.0801 1369.0162 1472.9164 1582.4067 1602.6642 1647.4201 1655.4145 1685.0730 3203.0751 3462.5954 3528.7254 3532.2433 3680.6694
redmass: 5.3894 8.1580 5.3784 5.9209 6.7276 8.8648 7.0890 6.7090 2.0916 1.5293 7.6157 5.5943 5.3979 1.3560 4.5547 2.5085 2.1422 3.2588 2.0950 1.4229 1.7936 5.8227 3.0271 6.6125 1.8772 2.0166 5.6747 1.4929 3.0964 1.9220 3.0616 4.1478 2.1404 5.6264 2.2384 7.2000 6.0293 1.0937 1.0773 1.0771 1.0458 1.1041
irintensity: 13.6570 1.9752 2.7366 1.4012 16.4629 3.7786 21.1798 8.3602 5.7905 66.4633 15.1925 0.5175 5.9595 205.9359 12.5072 4.3567 8.0276 22.0539 74.2847 74.7991 160.4037 2.3593 6.3633 9.6778 2.8951 20.8295 30.8127 6.4646 70.1221 68.3952 230.7488 95.6901 82.2917 81.9712 531.7080 236.9644 545.8550 1.8090 162.3407 66.9026 56.2320 43.2079
temp: 298.150 k
press: 1.00000 atm
elementType: 8 8 8 7 7 7 6 6 6 6 6 1 1 1 1 1
symmnumber: 1
zpe: 291943.7 jmol-1
zpe.correction: 0.111195 hartree
zpe.thermalcorrener: 0.120586 hartree
zpe.thermalcorrenthalpy: 0.121531 hartree
zpe.thermalcorrgfe: 0.075860 hartree
zpe.sumelectzpe: -582.718014 hartree
zpe.sumelectthermal: -582.708623 hartree
zpe.sumelectthermalent: -582.707679 hartree
zpe.sumelectthermalfe: -582.753350 hartree
dipole: 4.2773 -3.0604 0.0099
dipole: 5.2594
quadrupole: -60.3812 -74.8820 -63.7526
quadrupole: -13.0798 0.0445 -0.0191
quadrupole: 5.9574 -8.5434 2.5860 -13.0798 0.0445 -0.0191
hfenergy: -582.8292094 hartree
pointgroup: C01 [X(C5H5N3O3)]
dipole: 1.8563994 -0.6605718 0.6317025 debye
dipolederiv: -0.8369408 0.3556296 -0.2928855 0.3412728 -0.7784819 0.3125097 -0.2822424 0.313439 -0.6314595 -0.6826763 -0.3391099 0.2187461 -0.1899835 -0.8601587 0.3397998 0.1113953 0.3283092 -0.5943529 -0.7158738 -0.1564483 0.0843934 0.0367037 -0.7636387 0.2929804 -0.0557646 0.2773106 -0.5691775 -1.0528925 0.551194 -0.4593461 -0.1615099 -0.5875212 0.2056434 0.0545819 0.2630374 -0.4685052 -0.4362934 0.1204058 -0.0932382 0.1553034 -0.9465423 0.4367754 -0.1181511 0.4339098 -0.6797036 -0.9011004 0.3128658 -0.2468767 0.318871 -0.6171701 -0.0100863 -0.2507065 -0.0110547 -0.6783711 -0.0667684 -0.3735203 0.2536042 -0.1733424 0.5901476 -0.3471254 0.1090007 -0.364022 0.3979451 -0.5773548 -0.3705491 0.2381164 -0.081637 -0.3664133 0.0967455 0.0293958 0.0739643 -0.274486 1.5384561 -0.450757 0.4212868 -0.2600171 1.1267954 -0.5857047 0.2833344 -0.6010794 0.7978613 1.2001541 0.3119073 -0.1497759 0.0713681 1.1105092 -0.5971186 0.0234712 -0.5778641 0.6920938 1.4289159 0.0524364 0.058649 -0.1497686 0.9655801 -0.5222316 0.2053667 -0.505453 0.6456911 0.3587937 0.009619 -0.0047696 0.0829494 0.3198975 0.0164572 -0.0579107 0.010818 0.3210206 0.0070505 0.0431199 -0.045174 0.062684 0.1061948 0.0596801 -0.0590455 0.0579667 0.1357399 0.2329058 0.0097216 -0.0161802 0.0090485 0.2192313 0.0928678 -0.0155777 0.0929125 0.2789614 0.2511154 -0.0257453 0.0072617 -0.0043282 0.2512325 0.1007241 -0.0083157 0.0990092 0.3177864 0.252509 -0.0507696 0.0261884 -0.0576142 0.2303379 0.1080831 0.0311682 0.1087966 0.3089561 unknown
polarizability: 104.2505141|4.7585796|86.052161|2.1803669|-36.4330754|61.49277 unknown
InChI: InChI=1S/C5H5N3O3/c6-4(10)2-1-3(9)8-5(11)7-2/h1,7-8H,6H2
charge 0 multiplicity 1
16 atoms
O  -2.324798 1.871044 -1.412141
O  -1.828313 -1.895061 1.341309
O  2.422131 1.75292 -0.948687
N  -0.171695 1.206577 -0.760527
N  -2.041379 -0.012493 -0.033148
N  3.07448 -0.027977 0.396261
C  0.674961 0.347785 -0.07299
C  0.176891 -0.712412 0.650593
C  -1.573592 1.084384 -0.78549
C  -1.269641 -0.955414 0.708371
C  2.130577 0.740853 -0.238322
H  0.269559 1.97687 -1.281228
H  0.802408 -1.41338 1.204579
H  -3.058228 -0.141371 -0.02207
H  4.054106 0.233517 0.286496
H  2.842232 -0.837741 0.966993
