program: Gaussian 09
title: 000248961
version: EM64L-G09RevD.01
frameworkgroup: C1[X(C5H10N2)]
method: RPBEPBE
basis: SDD
operation: Freq
keyword: #pfreq=noraman
keyword: PBEPBE/SDD
title: #p freq=noraman PBEPBE/SDD
converged: YES YES NO NO
title: Mulliken charges:
elementType: N N C C C C C H H H H H H H H H H
charge: -0.286895 -0.020616 -0.347084 -0.325689 -0.430322 -0.684880 -0.148934 0.228226 0.207450 0.186132 0.216444 0.244968 0.237642 0.269430 0.233540 0.203859 0.216730
chargesum: 0.00000
title: Mulliken charges with hydrogens summed into heavy atoms:
elementType: N N C C C C C
charge: -0.041928 -0.020616 0.088592 0.076886 0.076750 -0.030750 -0.148934
polarizability: 9.13880971e+01 5.14257167e+00 5.57345962e+01 -4.57784492e-01 5.98591332e-01 4.95206744e+01
1716.lowfreq: -0.0002 0.0003 0.0009 2.6793 4.3155 31.6738 56.0058 90.6904 104.3606
frequency: 54.9928 90.2852 104.2206 141.5565 207.7623 250.9262 359.7976 376.9102 407.5391 535.2995 671.9712 784.9285 811.9352 888.2790 947.2930 1024.0367 1031.7044 1055.4380 1114.7243 1135.4238 1152.5811 1212.7507 1256.3525 1283.0793 1284.9119 1336.1602 1383.6912 1393.1496 1447.4507 1450.3786 1473.5865 1480.9746 1490.4337 1501.3747 2198.4508 2871.9158 2890.0044 2980.7912 2995.4195 3005.6882 3032.0956 3064.3164 3073.9495 3095.9031 3419.6021
redmass: 3.7076 3.3492 2.0942 2.7442 4.0057 1.1292 4.4930 3.5217 3.3250 4.5131 1.3795 1.1798 1.1070 2.0748 3.0524 2.9745 1.9334 2.4806 1.9691 1.4020 3.4721 1.4727 1.1817 1.1923 1.1958 1.3169 1.3076 1.2947 1.1072 1.1518 1.0597 1.0533 1.0818 1.0844 12.4307 1.0715 1.0712 1.0376 1.0617 1.0876 1.0878 1.0997 1.0979 1.1004 1.0741
irintensity: 2.4588 6.7144 1.3627 5.3836 3.9356 1.2025 2.2106 0.7733 2.0338 12.1509 98.9004 2.4559 6.6828 1.5043 2.7586 2.8694 8.9756 8.0735 7.5286 3.6738 76.0043 2.0467 8.4939 1.9227 0.8163 23.7604 8.3749 13.4484 12.9722 21.2405 16.6841 7.1793 1.4973 6.9080 14.7847 85.9454 115.0141 27.9408 8.3463 27.2285 18.5464 15.3993 53.9262 35.8074 1.8482
temp: 298.150 k
press: 1.00000 atm
elementType: 7 7 6 6 6 6 6 1 1 1 1 1 1 1 1 1 1
symmnumber: 1
zpe: 381429.5 jmol-1
zpe.correction: 0.145279 hartree
zpe.thermalcorrener: 0.153949 hartree
zpe.thermalcorrenthalpy: 0.154893 hartree
zpe.thermalcorrgfe: 0.111576 hartree
zpe.sumelectzpe: -305.437480 hartree
zpe.sumelectthermal: -305.428810 hartree
zpe.sumelectthermalent: -305.427866 hartree
zpe.sumelectthermalfe: -305.471183 hartree
dipole: 4.2523 0.9157 0.8663
dipole: 4.4352
quadrupole: -62.0045 -42.6176 -42.4144
quadrupole: -5.1834 1.1072 1.7548
quadrupole: -12.9924 6.3946 6.5978 -5.1834 1.1072 1.7548
hfenergy: -305.5827593 hartree
pointgroup: C01 [X(C5H10N2)]
dipole: 1.6762928 -0.3092605 -0.3731818 debye
dipolederiv: -0.8907795 -0.057758 -0.0339461 -0.0822196 -0.4961925 0.1990513 -0.0358761 0.2235293 -0.2718922 -0.3673993 -0.0136517 0.00373 0.0816017 -0.2302157 -0.0019339 0.0108401 0.0012433 -0.2398997 0.6391094 -0.0884265 0.0519113 -0.0457119 0.2375426 -0.1073145 -0.0832906 -0.0961399 0.3397096 0.4780551 0.2007529 0.0025308 0.3241932 0.3789858 -0.0888514 0.122548 -0.0685588 0.3260501 -0.1344535 0.0244905 0.0208502 -0.0123297 0.1268735 0.0326855 -0.0006001 0.0471984 0.2201411 -0.1224568 0.0315622 -0.0162924 0.0093573 0.037192 0.0130338 -0.004493 0.0319475 0.0897558 0.2050603 -0.1015576 0.0011266 -0.209685 -0.0397455 0.00023 -0.0171806 -0.0031447 -0.055898 0.0516025 -0.0132371 -0.0168962 0.0233741 -0.023659 -0.0893241 0.0074809 -0.1083224 -0.0556239 -0.1030094 0.0306838 -0.0375491 0.0851989 -0.0656274 0.1278725 -0.0947827 0.1606033 -0.1278563 -0.0697378 -0.0057263 -0.0258783 -0.1194885 -0.1658016 0.1428085 0.0407343 0.1990434 -0.1055815 0.0197937 0.0296854 0.0581086 -0.025988 -0.0174862 -0.0967726 0.0172492 -0.1241657 -0.1091476 0.1070968 -0.0040158 0.0074357 -0.0154988 0.1892208 -0.1024137 0.0166914 -0.2037861 0.0474185 0.0447869 0.0306522 0.0056488 0.0147688 0.0212861 -0.0821786 0.0098743 -0.1177576 -0.0018024 0.0787882 0.0302458 -0.0103939 0.0019462 0.0623434 0.0638032 0.0160519 0.0833725 -0.0023528 0.1036078 -0.0012182 0.018276 0.0536869 -0.0273602 0.1214141 -0.0214314 0.1244058 -0.0373544 0.0764475 0.0074045 -0.0077571 0.0572709 0.0182658 -0.109274 0.0394437 -0.1292547 -0.1212766 -0.116512 -0.0998861 -0.020905 -0.1404766 -0.005622 -0.022836 -0.0232593 -0.0202135 0.1056105 unknown
polarizability: 91.5858726|-4.4077509|55.467165|-0.1986981|0.9326718|49.5903301 unknown
InChI: InChI=1S/C5H10N2/c1-2-7-5-3-4-6/h7H,2-3,5H2,1H3
charge 0 multiplicity 1
17 atoms
N  1.231191 -0.302183 -0.096265
N  -3.647046 0.309552 0.055426
C  -0.091687 0.348138 -0.108738
C  2.383293 0.623861 0.02247
C  -1.194858 -0.735189 0.0403
C  3.709218 -0.15536 0.012752
C  -2.552862 -0.167161 0.04752
H  -0.145892 1.037742 0.753966
H  -0.293193 0.95705 -1.023132
H  2.397885 1.39617 -0.7864
H  2.279648 1.169387 0.980716
H  1.350335 -0.940772 -0.896645
H  -1.121822 -1.464878 -0.790306
H  -1.017867 -1.293547 0.977615
H  3.723952 -0.897117 0.830099
H  3.850389 -0.693918 -0.944152
H  4.566215 0.529626 0.140875
