program: Gaussian 09
title: 000248926
version: EM64L-G09RevD.01
frameworkgroup: C1[X(C6H5N3O2)]
method: RPBEPBE
basis: SDD
operation: Freq
keyword: #pfreq=noraman
keyword: PBEPBE/SDD
title: #p freq=noraman PBEPBE/SDD
converged: NO YES NO NO
title: Mulliken charges:
elementType: O O N N N C C C C C C H H H H H
charge: -0.245017 -0.207264 -0.395462 -0.054696 -0.009374 0.222893 0.133527 0.185115 -0.336432 -0.492677 -0.192440 0.366984 0.275947 0.253200 0.253203 0.242492
chargesum: 0.00000
title: Mulliken charges with hydrogens summed into heavy atoms:
elementType: O O N N N C C C C C C
charge: -0.245017 -0.207264 -0.028478 -0.054696 -0.009374 0.222893 0.133527 0.185115 -0.060484 0.256218 -0.192440
polarizability: 1.54798367e+02 2.56666737e-01 8.64410528e+01 5.78993315e-03 -5.97232635e-03 4.08855035e+01
1716.lowfreq: -5.2134 -4.7271 -0.0009 -0.0006 -0.0001 6.0145 77.0972 102.5441 125.1653
frequency: 77.0850 102.5420 125.1595 128.1677 195.7021 208.0616 250.0169 364.9073 380.2132 415.0747 463.7534 521.1443 560.8375 633.6482 687.5865 700.2607 735.7874 737.1197 787.1530 899.6597 947.3214 992.2196 1087.7102 1117.8342 1145.9411 1222.9130 1256.5128 1289.6135 1337.7662 1418.6691 1450.4071 1460.5109 1464.4446 1535.1676 1536.9377 1654.5857 2183.4342 3018.4002 3128.6551 3162.9366 3163.8349 3504.0485
redmass: 5.3132 1.8313 1.6941 8.6827 5.9587 4.0974 9.7386 6.6926 10.1141 2.9723 10.2357 9.4897 8.6236 5.7712 7.4192 12.1839 1.7429 6.9122 2.7235 8.2143 1.4643 4.7326 6.8486 1.2475 1.3946 6.5293 2.6476 2.9001 1.7722 1.2419 1.0498 1.6201 1.7737 4.2561 4.7596 8.2554 12.6222 1.0286 1.1057 1.1008 1.0992 1.0777
irintensity: 0.0020 0.4242 0.0390 1.3490 22.4862 3.4444 0.0908 5.8159 6.4606 7.9991 2.5684 2.7745 3.7214 11.3473 10.8019 5.1071 25.7891 17.1546 101.0034 26.9055 14.3238 76.7112 3.2512 0.0730 12.1491 4.6323 169.2381 68.0149 11.9626 41.0156 17.1171 24.0023 55.4270 716.4390 78.2615 433.7459 24.5869 33.4275 17.4647 20.6160 0.1564 64.9500
temp: 298.150 k
press: 1.00000 atm
elementType: 8 8 7 7 7 6 6 6 6 6 6 1 1 1 1 1
symmnumber: 1
zpe: 287425.2 jmol-1
zpe.correction: 0.109474 hartree
zpe.thermalcorrener: 0.119347 hartree
zpe.thermalcorrenthalpy: 0.120291 hartree
zpe.thermalcorrgfe: 0.073785 hartree
zpe.sumelectzpe: -545.537289 hartree
zpe.sumelectthermal: -545.527416 hartree
zpe.sumelectthermalent: -545.526472 hartree
zpe.sumelectthermalfe: -545.572978 hartree
dipole: 8.1209 -1.1351 0.0003
dipole: 8.1998
quadrupole: -73.6142 -64.8160 -62.1677
quadrupole: 1.1400 0.0002 -0.0007
quadrupole: -6.7482 2.0500 4.6983 1.1400 0.0002 -0.0007
hfenergy: -545.646763 hartree
pointgroup: C01 [X(C6H5N3O2)]
dipole: 3.1741101 -0.5766084 0.0001196 debye
dipolederiv: -1.9724283 0.1820092 -0.0001407 -0.1286484 -0.4452689 0.000009 -0.0001275 0.000056 -0.3138555 -0.5813133 0.3390484 -0.0001536 0.397407 -1.0434298 0.0002334 0.0000432 -0.0001078 -0.3442643 -0.9506863 0.4797959 -0.0000652 0.0793623 -0.5586307 0.0000369 -0.0001354 0.0000966 -0.2824006 -1.4619283 -0.0226485 -0.0000735 -0.9654078 -0.6375561 -0.0000058 0.0000759 0.0000215 -0.2488238 -0.3906587 -0.0636333 0.0000933 -0.0772565 -0.2210489 0.0000075 0.0000595 -0.0000117 -0.2399329 1.9824734 -0.1531142 0.0001512 1.0325748 0.9851509 -0.0000343 -0.0000355 -0.000135 0.2945521 1.0362099 -0.4948312 0.0001869 -0.4633565 1.3737866 -0.0002808 0.0001594 -0.0000692 0.239406 -0.374732 -0.048297 -0.000048 0.4866288 -0.4898064 0.0000987 -0.0000616 0.0001413 0.0401149 1.2327009 -0.1351477 0.0001076 -0.0724783 0.4134064 -0.000102 0.0001144 -0.0000519 -0.0146196 0.7996218 -0.1566931 0.0000553 -0.4470725 0.3466949 -0.0000305 0.0001352 -0.0000073 0.264038 0.4021863 0.1264416 -0.0001018 0.0899126 -0.0396784 0.0000209 -0.0001335 0.0000292 0.0552791 0.1904169 0.0441077 -0.0000306 0.0179501 0.222488 0.000023 -0.0000443 0.0000176 0.3491382 0.0704236 -0.0410435 0.0000108 -0.0833191 -0.004817 0.0000299 -0.0000309 0.0000431 0.1448114 0.0590807 -0.0090458 -0.0554166 0.1155561 0.0233393 -0.0719322 -0.0082411 -0.0821971 -0.0378941 0.0590883 -0.0090639 0.0554543 0.1155242 0.0233663 0.0719386 0.0082449 0.0821778 -0.0378898 -0.1004551 -0.0378845 -0.0000294 -0.097377 0.0520037 -0.0000122 -0.0000227 -0.0000031 0.1323407 unknown
polarizability: 154.7054073|-2.5321327|86.5340122|0.0055413|-0.0062037|40.8855035 unknown
InChI: InChI=1S/C6H5N3O2/c1-11-6-8-3-4(2-7)5(10)9-6/h3,9H,1H3
charge 0 multiplicity 1
16 atoms
O  2.835496 0.403273 0.000133
O  -1.454856 2.141645 -0.000242
N  0.677927 1.180717 -0.000198
N  1.074057 -1.177961 0.000199
N  -3.806207 -0.804279 -0.000026
C  1.507446 0.084902 0.000061
C  -0.761168 1.093827 -0.000444
C  -1.227735 -0.306292 -0.000033
C  -0.296021 -1.352077 0.000169
C  3.797135 -0.732026 0.000388
C  -2.633466 -0.567595 0.000127
H  1.079546 2.125337 -0.000278
H  -0.639197 -2.391072 0.000406
H  3.648927 -1.349177 -0.899763
H  3.648625 -1.349033 0.900587
H  4.781792 -0.245789 0.000511
