program: Gaussian 09
title: 000248909
version: EM64L-G09RevD.01
frameworkgroup: C1[X(C8H5ClN2O6)]
method: RPBEPBE
basis: SDD
operation: Freq
keyword: #p
keyword: freq=noraman
keyword: PBEPBE/SDD
title: #p freq=noraman PBEPBE/SDD
converged: YES YES NO NO
title: Mulliken charges:
elementType: Cl O O O O O O N N C C C C C C C C H H H H H
charge: 0.124675 -0.283616 -0.200970 -0.168828 -0.152150 -0.183521 -0.182128 -0.002845 0.018748 0.449279 0.604332 0.463996 -0.595405 -0.488919 -0.497753 0.177238 -0.492271 0.333861 0.332390 0.249615 0.251304 0.242967
chargesum: 0.00000
title: Mulliken charges with hydrogens summed into heavy atoms:
elementType: Cl O O O O O O N N C C C C C C C C
charge: 0.124675 -0.283616 -0.200970 -0.168828 -0.152150 -0.183521 -0.182128 -0.002845 0.018748 0.449279 0.604332 0.463996 -0.595405 -0.155058 -0.165362 0.177238 0.251615
polarizability: 1.79865338e+02 -2.23588105e+00 1.83847449e+02 2.86658448e+00 -1.80349841e+00 6.48370009e+01
1716.lowfreq: -0.0017 0.0009 0.0015 3.3437 5.3239 7.6444 29.9991 46.4948 52.3175
frequency: 29.9941 46.4935 52.3154 53.9910 91.5173 102.0612 112.4198 145.4143 149.8777 200.2464 215.2948 248.3863 284.0768 292.8041 308.0496 321.6266 364.9176 374.8033 475.3923 499.6362 517.6588 580.2980 596.7991 676.1997 685.9556 703.2021 714.3879 719.4347 742.1977 783.8863 828.1864 882.2916 945.7985 953.4341 977.4093 1030.9620 1099.8828 1114.3831 1116.8285 1150.0901 1182.8782 1205.8761 1213.8784 1251.2097 1370.7660 1380.1512 1387.0286 1405.1211 1424.1429 1433.0891 1453.4452 1461.4149 1580.4958 1597.1641 1643.5148 3011.2617 3116.0901 3160.2696 3186.4565 3198.6808
redmass: 6.3065 11.6278 13.9027 16.3639 1.7926 2.4342 3.8864 5.8660 9.4222 5.9076 10.5269 7.9819 10.3021 7.4066 11.3261 8.0791 10.6833 8.1281 7.6035 6.8641 6.3293 7.2240 8.5807 9.4118 8.8144 8.8573 5.5476 7.2710 9.9774 5.8362 8.3661 11.4864 8.1322 1.4911 1.5796 6.6168 2.5832 1.9218 1.5788 1.4631 2.4310 8.9253 3.5200 5.6801 6.2037 11.2064 7.4469 6.1869 1.3075 3.6044 1.0487 1.0517 7.5918 9.2157 10.6771 1.0295 1.1050 1.1053 1.0932 1.0924
irintensity: 1.3287 0.0708 0.4744 0.1012 0.2434 2.1409 1.1226 7.9486 2.8682 4.3919 3.1516 4.7999 0.7193 7.6421 2.0798 1.6615 3.7334 0.7783 2.4927 8.4103 4.2267 10.0368 24.8842 29.6523 20.3961 8.3321 7.5746 0.0940 6.4608 8.6689 5.9858 34.9004 9.9832 14.7040 27.8595 74.8959 104.1089 74.1530 51.1140 49.1892 25.0720 277.1085 247.3617 77.0902 82.4833 29.5053 75.3530 50.9809 40.8965 44.3387 16.3477 11.9437 25.4754 25.8003 173.3161 26.0710 19.0778 9.6912 21.5234 15.0593
temp: 298.150 k
press: 1.00000 atm
elementType: 17 8 8 8 8 8 8 7 7 6 6 6 6 6 6 6 6 1 1 1 1 1
symmnumber: 1
zpe: 346029.0 jmol-1
zpe.correction: 0.131796 hartree
zpe.thermalcorrener: 0.147701 hartree
zpe.thermalcorrenthalpy: 0.148645 hartree
zpe.thermalcorrgfe: 0.085982 hartree
zpe.sumelectzpe: -1327.336097 hartree
zpe.sumelectthermal: -1327.320192 hartree
zpe.sumelectthermalent: -1327.319248 hartree
zpe.sumelectthermalfe: -1327.381910 hartree
dipole: 4.7945 0.6337 0.5309
dipole: 4.8653
quadrupole: -98.5976 -126.2342 -102.7352
quadrupole: 3.8419 1.7742 -0.2798
quadrupole: 10.5914 -17.0452 6.4538 3.8419 1.7742 -0.2798
hfenergy: -1327.4678925 hartree
pointgroup: C01 [X(C8H5Cl1N2O6)]
dipole: -1.8275709 -0.4840592 0.2993353 debye
dipolederiv: -0.0196312 0.2215652 0.0025731 0.2238454 -0.5674809 0.0656702 -0.003494 0.0581383 0.0532501 -1.1945897 -0.3459053 0.1795177 -0.5471315 -0.6946436 0.2668021 0.3560375 0.2479657 -0.4372692 -0.7601288 0.19712 -0.130904 -0.023297 -0.565243 0.2221736 0.0364683 0.1941691 -0.415479 -0.6491117 -0.0970493 0.2785169 -0.1663616 -0.3964368 -0.0797346 0.1763635 -0.1023396 -0.4207191 -0.3617171 -0.1549853 0.0865185 -0.1132011 -0.5944859 -0.2542782 0.146575 -0.1521063 -0.4080502 -0.5122614 -0.0833009 -0.0003381 -0.0937677 -0.8187437 0.0321894 0.007935 0.0375926 -0.209632 -0.7649159 0.1573586 -0.017087 0.1798374 -0.5702609 0.0184231 -0.009689 0.0214806 -0.2087697 0.9844122 0.4304621 -0.4395939 0.5496454 0.9933182 0.3793942 -0.3653872 0.2493338 0.6826226 1.1386666 -0.2846732 0.0289475 -0.3023204 1.6876933 -0.0847961 0.009106 -0.0894759 0.1867931 -0.4009161 -0.0545025 0.0036173 0.0408056 -0.5163253 0.0745162 -0.0250222 0.0734184 0.0463619 -0.3066997 0.1360044 0.0373959 0.0245124 -0.37362 -0.0231094 0.0575397 0.0060507 0.0532525 -0.21435 0.1514085 -0.0051087 0.1457431 -0.5233951 0.0438844 0.0013719 0.0454773 0.0751229 0.3939151 -0.2720318 0.042972 -0.2633937 0.9976933 -0.0918511 -0.0698436 -0.1424287 -0.063619 0.0996483 -0.2661216 0.0057828 -0.1057149 0.0977178 -0.0073088 0.04486 -0.0298313 -0.0590487 -0.1404567 0.0798172 -0.0115598 -0.0437092 0.3061273 -0.0395833 0.0417793 0.0448334 -0.0539021 1.6807845 0.1259476 -0.0233511 0.4336992 0.944723 -0.5343386 -0.2796078 -0.4245331 0.5257508 0.7203083 0.1691796 -0.0813317 0.1028973 0.2527436 0.0054383 -0.0808354 -0.0101143 0.2719563 0.1780451 -0.0004751 -0.0055805 -0.0493328 0.1307889 0.0014464 -0.0222668 0.0016632 0.163626 0.1408238 -0.0170077 -0.0019432 0.0008641 0.1554343 0.0106036 -0.0082106 -0.0230885 0.1720404 -0.038268 -0.0463914 0.0034129 0.0085445 0.10089 0.0045745 -0.0758539 -0.0276277 -0.0859257 -0.0224964 -0.0252665 0.0345077 0.0777032 -0.0215497 -0.1000124 0.0228507 -0.0637086 0.0572263 0.0489385 -0.0211526 0.0130357 -0.0798676 -0.024945 0.0898965 0.0393236 0.0851307 0.0744119 unknown
polarizability: 180.2291396|-3.0818689|182.8540872|-6.5414533|-6.3083879|65.4665611 unknown
InChI: InChI=1S/C8H5ClN2O6/c1-17-8(12)5-2-4(10(13)14)3-6(7(5)9)11(15)16/h2-3H,1H3
charge 0 multiplicity 1
22 atoms
Cl -0.809164 2.952614 -0.188745
O  -3.135791 -0.822059 0.536838
O  -3.192148 1.213504 -0.591829
O  3.246041 2.016959 -0.858347
O  2.03232 3.19033 0.683137
O  0.629283 -3.671795 0.227287
O  2.7452 -2.813232 0.170973
N  2.228638 2.179412 -0.082518
N  1.46233 -2.690479 0.167195
C  -1.041354 0.161001 0.000658
C  1.237476 1.064536 -0.049352
C  0.903164 -1.315361 0.087726
C  -0.166357 1.285235 -0.064932
C  -0.489779 -1.138188 0.099331
C  1.786155 -0.227778 -0.002372
C  -2.541427 0.286664 -0.066039
C  -4.620641 -0.844806 0.507998
H  -1.150578 -2.003982 0.176317
H  2.868347 -0.380358 -0.030623
H  -4.977765 -0.86961 -0.53486
H  -5.020474 0.050942 1.010831
H  -4.893878 -1.761846 1.046728
