program: Gaussian 09
title: 000248929
version: EM64L-G09RevD.01
frameworkgroup: C1[X(C22H32O2S)]
method: RPBEPBE
basis: SDD
operation: Freq
keyword: #p
keyword: freq=noraman
keyword: PBEPBE/SDD
title: #p freq=noraman PBEPBE/SDD
converged: NO YES NO NO
title: Mulliken charges:
elementType: S O O C C C C C C C C C C C C C C C C C C C C C C H H H H H H H H H H H H H H H H H H H H H H H H H H H H H H H H
charge: 0.147409 -0.225682 -0.232687 -0.108772 0.390593 -0.152847 -0.114883 -0.180667 0.252999 -0.537733 -0.526095 -0.526409 -0.579901 -0.486796 -0.821412 0.511098 -0.633295 -0.509598 -0.816133 0.176803 -0.553394 -0.560194 0.175887 -0.804019 -0.846464 0.222985 0.222632 0.218472 0.263802 0.206764 0.207435 0.239818 0.244279 0.226770 0.207908 0.312641 0.230742 0.224192 0.243404 0.230108 0.222908 0.225164 0.228810 0.211646 0.219290 0.223015 0.226520 0.233150 0.230576 0.242822 0.254167 0.251936 0.250449 0.253441 0.257699 0.283706 0.244939
chargesum: 0.00000
title: Mulliken charges with hydrogens summed into heavy atoms:
elementType: S O O C C C C C C C C C C C C C C C C C C C C C C
charge: 0.147409 -0.225682 -0.232687 0.114214 0.390593 0.069786 0.103589 0.083135 0.252999 -0.123535 -0.041998 -0.091732 -0.267259 -0.031862 -0.124992 0.511098 -0.179321 -0.078663 -0.133448 0.176803 -0.079996 -0.306027 0.175887 -0.048193 -0.060120
polarizability: 3.21914081e+02 -6.03672232e-01 2.27045697e+02 1.97716643e+01 -1.85147089e+00 2.12294531e+02
1716.lowfreq: -10.1269 -6.9073 -0.0006 0.0006 0.0007 4.9263 10.3205 25.6566 33.4501
frequency: 7.5359 25.6322 33.1648 50.0370 58.2708 65.0232 96.2087 105.7083 109.9825 127.8369 140.7440 146.8543 157.1284 179.5655 190.8250 204.9551 217.4387 226.5763 237.8132 256.4833 264.7915 270.4695 283.9515 300.5469 309.7749 349.1093 360.4976 369.6269 381.3818 397.7230 411.4463 436.8460 451.0953 460.9384 488.8424 496.3923 514.2943 527.3148 529.7781 577.4777 578.7011 613.6504 631.8944 644.5927 656.6329 678.6333 697.9480 726.6982 757.6064 777.2147 803.9686 826.7394 835.1061 858.4823 888.1634 897.5101 914.0622 917.1566 924.5716 929.6890 939.4217 949.1825 966.1019 967.1927 973.1531 985.2463 989.6662 998.2993 1004.1814 1009.6477 1027.4043 1038.4089 1049.4147 1055.0584 1068.8063 1075.2899 1103.0478 1105.7654 1108.1481 1115.3974 1122.6159 1141.6358 1155.1546 1163.4815 1173.5638 1179.3220 1185.5761 1187.3523 1210.5876 1212.3688 1227.7981 1234.1402 1234.8639 1251.4631 1263.8601 1267.5789 1276.6019 1279.7311 1286.5100 1304.5227 1314.4432 1319.3949 1325.0231 1326.6359 1331.3656 1333.7791 1342.0982 1343.1915 1344.7327 1348.2586 1352.5325 1365.5765 1367.5876 1391.6133 1398.9133 1442.7427 1447.4224 1448.1842 1449.4196 1456.9875 1463.5938 1466.0340 1466.1615 1467.0085 1471.8146 1475.0806 1480.6990 1482.0203 1487.2085 1492.8535 1586.4193 1616.7720 1625.5311 2916.9394 2927.3318 2955.9851 2965.5900 2974.7650 2976.5245 2977.9776 2981.5616 2982.9506 2985.9941 2989.6693 2990.2426 2992.5757 2993.9429 3006.8767 3018.6467 3037.3558 3043.6562 3049.2524 3050.6739 3056.2203 3064.3718 3065.7757 3070.5663 3070.8143 3075.9715 3085.1388 3090.2734 3119.1209 3120.0588 3124.6490 3134.1532
redmass: 3.2236 5.2891 5.7219 4.4897 3.4395 5.1117 2.9185 1.3973 2.0939 2.2694 1.4963 1.7227 3.3027 2.6676 2.6929 1.5086 1.7595 2.2839 3.7631 2.9014 2.6000 3.0404 3.0152 2.4851 2.8486 2.6096 3.2746 2.6032 3.2588 2.9352 3.1775 3.2832 3.4028 3.2083 3.5257 2.8732 3.1357 2.7269 2.7844 3.8940 2.4812 4.0479 2.6425 3.6434 6.4648 3.4548 3.3383 2.6822 2.8955 2.5096 2.0690 2.1386 2.6061 2.2643 1.4597 2.1196 2.0059 2.0968 1.9875 2.2564 1.8056 2.0918 1.1845 2.1103 1.5704 1.6035 1.8482 1.8650 1.9853 1.8846 2.3583 1.8487 2.1199 2.8498 2.8522 2.8338 1.8693 1.7793 2.2546 1.5737 2.0348 1.7464 2.4728 1.4676 1.4486 1.8551 2.0872 1.5104 1.7021 1.8199 1.5968 1.6291 1.4619 1.5400 1.3782 1.2662 2.0113 1.4524 1.3701 1.2883 1.3629 1.4483 1.4469 1.5409 1.3051 1.4304 1.6852 1.3159 1.2808 1.7692 1.4516 1.2555 1.4638 1.2071 1.2067 1.0747 1.0543 1.0811 1.0637 1.0703 1.0817 1.0696 1.0829 1.0764 1.0773 1.0840 1.0702 1.0597 1.0689 1.0621 9.9591 7.3391 7.7341 1.0815 1.0806 1.0604 1.0701 1.0718 1.0674 1.0438 1.0410 1.0761 1.0606 1.0464 1.0596 1.0636 1.0569 1.0285 1.0971 1.0989 1.0999 1.0861 1.0977 1.1021 1.0938 1.0953 1.0985 1.0989 1.0975 1.0988 1.0985 1.0912 1.1011 1.1049 1.1043
irintensity: 1.4013 0.7613 3.2914 7.4214 0.4779 1.5089 1.6122 1.0464 0.3009 0.8434 1.1331 0.2384 0.6821 0.0959 1.1999 0.5172 0.7685 1.8275 3.1594 0.0998 1.3958 1.7568 0.7245 0.5035 1.8343 1.1460 1.2283 0.2475 3.8904 2.9754 0.6530 1.2646 3.2351 0.3666 1.1816 2.8482 0.4584 4.6590 0.3577 9.7187 1.3210 4.1915 1.5457 0.1372 1.4362 3.2343 8.8142 5.2776 4.6223 4.8264 0.4014 2.0906 1.5916 5.9514 21.8578 7.0006 2.1711 6.3739 1.7175 3.0681 3.5679 7.6235 8.7568 3.2767 4.0703 17.0850 5.8793 0.7606 1.4553 2.5891 2.3805 4.2137 6.2907 1.1571 2.4647 3.4747 1.8936 8.0012 1.3554 2.1136 3.5169 15.8503 3.2784 13.3946 36.8788 18.7569 4.0812 1.4070 19.7381 31.2796 13.4511 16.7553 39.7264 15.5802 17.1049 7.6728 31.6311 2.8066 1.8533 0.6573 6.1927 1.8273 11.6890 8.9827 2.5337 19.3286 5.6532 0.7754 1.6968 1.6698 5.6736 64.0524 19.5320 15.1197 34.5309 16.3332 13.0090 15.1909 9.8801 3.8699 10.9817 12.9200 16.6150 13.5913 1.9362 18.5399 8.3375 2.2330 11.4275 6.2219 176.9177 113.7144 197.0664 5.5652 14.0583 36.5907 12.8153 22.0190 10.1019 0.9239 7.4332 20.6761 28.0692 4.9762 38.0450 17.3953 57.6675 36.0099 46.5309 39.1953 37.3536 2.9341 43.6041 36.8219 7.7584 23.3349 8.9653 40.4379 27.1212 37.9310 30.5676 9.6953 14.4799 16.1662 8.7161
temp: 298.150 k
press: 1.00000 atm
elementType: 16 8 8 6 6 6 6 6 6 6 6 6 6 6 6 6 6 6 6 6 6 6 6 6 6 1 1 1 1 1 1 1 1 1 1 1 1 1 1 1 1 1 1 1 1 1 1 1 1 1 1 1 1 1 1 1 1
symmnumber: 1
zpe: 1287142.3 jmol-1
zpe.correction: 0.490247 hartree
zpe.thermalcorrener: 0.516082 hartree
zpe.thermalcorrenthalpy: 0.517026 hartree
zpe.thermalcorrgfe: 0.433274 hartree
zpe.sumelectzpe: -1404.117138 hartree
zpe.sumelectthermal: -1404.091303 hartree
zpe.sumelectthermalent: -1404.090359 hartree
zpe.sumelectthermalfe: -1404.174111 hartree
dipole: 2.3234 2.1431 2.4501
dipole: 3.9992
quadrupole: -204.2485 -155.9736 -164.1676
quadrupole: -9.6053 -22.3342 -10.9032
quadrupole: -29.4520 18.8229 10.6290 -9.6053 -22.3342 -10.9032
hfenergy: -1404.6073849 hartree
pointgroup: C01 [X(C22H32O2S1)]
dipole: -1.0380192 0.6982502 -0.9542655 debye
polarizability: 321.6206175|12.3168342|228.7313924|15.4180601|3.1875523|210.9022994 unknown
InChI: InChI=1S/C22H32O2S/c1-13(23)20-19(25-4)12-18-16-6-5-14-11-15(24)7-9-21(14,2)17(16)8-10-22(18,20)3/h11,16-20H,5-10,12H2,1-4H3
charge 0 multiplicity 1
57 atoms
S  -3.992319 -2.544496 1.314371
O  -5.097539 0.726624 -0.461847
O  5.994561 -0.183951 1.967127
C  -0.83738 -0.748548 -0.090434
C  -1.704782 0.552131 -0.201301
C  0.528341 -0.63057 -0.797347
C  1.322555 0.550388 -0.13694
C  -2.991905 0.041849 0.569578
C  2.778467 0.700078 -0.754637
C  -0.920396 1.703282 0.47273
C  -1.804582 -1.891767 -0.482993
C  0.493239 1.865404 -0.153894
C  -3.204307 -1.397476 0.009445
C  1.31998 -1.960416 -0.74105
C  -2.075114 0.925739 -1.661206
C  3.438871 -0.67957 -0.608556
C  2.752711 -1.814784 -1.336656
C  3.641766 1.782393 -0.035426
C  2.717935 1.109138 -2.259557
C  -4.232686 0.925885 0.437375
C  4.188246 1.355002 1.341467
C  4.482081 -0.923766 0.249855
C  4.994832 0.061028 1.224408
C  -4.396493 2.048608 1.451205
C  -5.720132 -2.73383 0.578127
H  -0.617359 -0.873709 0.995428
H  0.352384 -0.391801 -1.867008
H  1.464307 0.265779 0.93121
H  -2.722752 -0.014061 1.644037
H  -0.814561 1.48714 1.556826
H  -1.462473 2.665444 0.381798
H  -1.818693 -2.046994 -1.579067
H  -1.531773 -2.854371 -0.020146
H  0.395215 2.231984 -1.193709
H  1.028927 2.654815 0.405735
H  -3.939018 -1.360533 -0.812616
H  0.770255 -2.748885 -1.289071
H  1.404988 -2.295177 0.313416
H  -2.672392 0.140271 -2.15473
H  -2.682802 1.848916 -1.678755
H  -1.180876 1.108497 -2.28095
H  2.673214 -1.614482 -2.422523
H  3.313684 -2.758099 -1.210864
H  3.069709 2.723412 0.054433
H  4.506356 2.009851 -0.691023
H  2.017807 0.496728 -2.851975
H  2.40503 2.165018 -2.354565
H  3.718479 1.017856 -2.720646
H  3.359383 1.173914 2.056717
H  4.829813 2.136365 1.785245
H  4.937769 -1.921582 0.298358
H  -4.697617 1.608396 2.422755
H  -3.445106 2.581907 1.624845
H  -5.17705 2.753891 1.12557
H  -5.67809 -3.323903 -0.350668
H  -6.155118 -1.742053 0.38344
H  -6.322193 -3.26741 1.330665
