program: Gaussian 09
title: 000248883
version: EM64L-G09RevD.01
frameworkgroup: C1[X(C14H14N4)]
method: RPBEPBE
basis: SDD
operation: Freq
keyword: #pfreq=noraman
keyword: PBEPBE/SDD
title: #p freq=noraman PBEPBE/SDD
converged: YES YES NO NO
title: Mulliken charges:
elementType: N N N N C C C C C C C C C C C C C C H H H H H H H H H H H H H H
charge: -0.067200 -0.067024 -0.052877 -0.052948 0.153377 0.153414 0.119816 0.119506 -0.300189 -0.300132 -0.292888 -0.292789 -0.171801 -0.171881 -0.783173 -0.783141 -0.331126 -0.330924 0.237700 0.237672 0.273745 0.273855 0.237912 0.237908 0.254160 0.228163 0.228712 0.254140 0.228689 0.228144 0.265583 0.265596
chargesum: 0.00000
title: Mulliken charges with hydrogens summed into heavy atoms:
elementType: N N N N C C C C C C C C C C C C C C
charge: -0.067200 -0.067024 -0.052877 -0.052948 0.153377 0.153414 0.119816 0.119506 -0.062490 -0.062460 -0.019143 -0.018934 0.066111 0.066028 -0.072139 -0.072168 -0.065543 -0.065328
polarizability: 4.15820684e+02 7.62532613e+00 1.34230426e+02 1.11908573e-01 1.43824170e-01 1.23977451e+02
1716.lowfreq: -66.3598 -9.0780 -3.3220 -0.0001 0.0003 0.0007 0.5883 11.2189 17.6426
frequency: -66.1692 9.0567 17.4599 33.1779 40.1119 86.3633 102.2402 141.1220 170.8012 182.6752 194.4029 223.5503 260.0901 268.8372 330.3516 350.9830 417.7218 426.3327 442.7734 449.2368 473.3935 536.3570 536.6951 587.3922 592.5603 623.0608 651.5207 742.7897 742.9722 764.4907 787.4018 808.0372 809.8133 890.6874 916.5142 922.4031 922.5692 944.1198 946.7895 948.1008 955.0349 976.1780 996.7973 1000.5096 1000.5993 1027.7777 1047.7042 1047.8230 1083.0156 1083.6063 1166.7045 1167.4308 1237.3497 1237.6936 1253.5879 1260.6655 1298.2368 1324.2448 1328.4097 1338.2051 1377.7029 1388.4245 1390.9667 1409.5973 1446.1934 1448.0653 1462.9537 1465.5211 1469.7572 1470.4327 1560.6909 1567.6306 1574.3419 1575.7848 1584.6804 1589.5284 2984.0996 2984.1544 3062.0105 3062.2240 3066.6843 3067.2956 3116.7441 3117.0974 3134.6547 3134.7701 3154.3414 3154.5287 3172.9200 3173.1758
redmass: 1.0175 1.0872 3.3584 5.1647 4.8646 4.5079 5.0792 5.7879 3.3995 3.0075 3.8649 4.5946 3.4872 3.2539 3.2660 4.1525 5.2531 3.7482 4.2598 4.0287 5.3651 5.1513 5.1660 3.5941 3.6105 6.4846 7.2138 2.2712 2.2180 4.4837 4.0711 1.6755 1.8071 4.0540 2.5295 1.3585 1.3722 3.1748 1.5794 1.5591 5.8298 2.8479 1.8318 1.3417 1.3403 2.8870 1.5863 1.5861 1.5127 1.5157 1.1090 1.1087 1.9312 1.9302 1.7020 2.1611 3.3158 4.5556 5.0126 2.6363 2.5972 1.2630 1.3493 2.5797 2.6534 2.4539 1.1192 1.2041 1.0480 1.0470 6.7314 6.2998 6.1372 5.4193 7.8499 6.8006 1.0382 1.0382 1.0973 1.0973 1.0895 1.0910 1.0982 1.0982 1.0876 1.0876 1.0943 1.0943 1.0986 1.0985
irintensity: 0.3577 0.3246 0.0581 2.1630 1.6557 0.4066 0.0026 0.0893 3.6457 0.7758 7.3675 2.7696 17.3642 16.0032 14.0937 0.1504 12.9584 0.0032 1.6487 0.1391 15.3990 1.1857 17.2530 0.0583 0.5227 0.8283 55.1491 20.5994 16.3919 2.6439 98.0316 38.0168 37.4390 4.2167 13.5733 0.3794 1.3983 6.2426 28.0212 41.5555 5.9346 5.6252 6.2604 0.9228 1.0987 3.2497 8.0420 8.0808 18.5186 2.8627 1.0185 0.6149 3.4589 1.7694 14.9075 1.0963 58.3963 0.0908 1.3558 1.8256 6.1387 10.6841 30.4744 4.0659 150.3655 20.0023 52.9286 2.7801 15.3632 15.4742 1.8468 161.3359 29.5205 28.6006 4.0286 7.0496 39.6466 10.6813 19.4378 19.5768 15.2918 4.4232 8.4528 8.3944 5.2719 5.1851 31.3706 14.4436 8.0490 7.8612
temp: 298.150 k
press: 1.00000 atm
elementType: 7 7 7 7 6 6 6 6 6 6 6 6 6 6 6 6 6 6 1 1 1 1 1 1 1 1 1 1 1 1 1 1
symmnumber: 1
zpe: 653720.3 jmol-1
zpe.correction: 0.248989 hartree
zpe.thermalcorrener: 0.265282 hartree
zpe.thermalcorrenthalpy: 0.266226 hartree
zpe.thermalcorrgfe: 0.200897 hartree
zpe.sumelectzpe: -759.582874 hartree
zpe.sumelectthermal: -759.566581 hartree
zpe.sumelectthermalent: -759.565636 hartree
zpe.sumelectthermalfe: -759.630966 hartree
dipole: 0.0030 0.0041 -0.4132
dipole: 0.4132
quadrupole: -64.7691 -103.1561 -105.9883
quadrupole: 9.5728 0.1753 0.0481
quadrupole: 26.5354 -11.8516 -14.6838 9.5728 0.1753 0.0481
hfenergy: -759.8318627 hartree
pointgroup: C01 [X(C14H14N4)]
dipole: 0.0043231 0.0159078 0.1617326 debye
polarizability: 411.6605414|-34.7660346|138.2851627|-2.1610058|-0.6989381|124.0828558 unknown
InChI: InChI=1S/C14H14N4/c1-11-5-3-7-13(17-11)9-15-16-10-14-8-4-6-12(2)18-14/h3-10H,1-2H3
charge 0 multiplicity 1
32 atoms
N  3.917167 0.271911 -0.625355
N  -3.936987 -0.370008 -0.41978
N  0.633677 -0.217293 0.806471
N  -0.603145 0.354484 0.776734
C  5.21074 -0.166246 -0.56196
C  -5.227529 0.080511 -0.389544
C  2.989385 -0.287477 0.223163
C  -2.978697 0.328497 0.278321
C  5.612813 -1.175299 0.355437
C  -5.595554 1.242197 0.342997
C  3.318102 -1.301977 1.161305
C  -3.272678 1.498803 1.027566
C  4.653966 -1.745188 1.2238
C  -4.605397 1.954576 1.057313
C  6.1994 0.472968 -1.5159
C  -6.251393 -0.715615 -1.173016
C  1.627623 0.25245 0.083263
C  -1.622086 -0.234823 0.188522
H  6.657952 -1.501573 0.38159
H  -6.639121 1.574539 0.347155
H  2.535268 -1.708449 1.807583
H  -2.466246 2.011383 1.559241
H  4.946983 -2.523579 1.936525
H  -4.872057 2.85176 1.626259
H  5.686703 1.235046 -2.122583
H  7.031189 0.95476 -0.968984
H  6.645393 -0.278372 -2.194143
H  -5.75696 -1.56294 -1.672288
H  -7.045608 -1.109056 -0.5113
H  -6.744491 -0.089735 -1.939984
H  1.500788 1.060924 -0.654827
H  -1.521302 -1.16508 -0.393682
