program: Gaussian 09
title: 000248853
version: EM64L-G09RevD.01
frameworkgroup: C1[X(C10H7FN2O2)]
method: RPBEPBE
basis: SDD
operation: Freq
keyword: #p
keyword: freq=noraman
keyword: PBEPBE/SDD
title: #p freq=noraman PBEPBE/SDD
converged: NO NO NO NO
title: Mulliken charges:
elementType: F O O N N C C C C C C C C C C H H H H H H H
charge: -0.205344 -0.188962 -0.210767 -0.449605 -0.416228 0.352952 0.344666 -0.381303 0.099962 0.166285 -0.328386 -0.328584 -0.349196 -0.349252 0.316876 0.235414 0.336279 0.358044 0.242440 0.242423 0.256142 0.256144
chargesum: 0.00000
title: Mulliken charges with hydrogens summed into heavy atoms:
elementType: F O O N N C C C C C C C C C C
charge: -0.205344 -0.188962 -0.210767 -0.113326 -0.058184 0.352952 0.344666 -0.145889 0.099962 0.166285 -0.085946 -0.086160 -0.093054 -0.093107 0.316876
polarizability: 2.04292323e+02 -6.33435764e+00 9.19390812e+01 9.00874096e-02 1.49264226e-01 9.23605030e+01
1716.lowfreq: -61.7776 -8.2885 -0.0005 -0.0004 0.0002 2.6188 3.3757 46.1761 46.6926
frequency: -61.7610 46.1294 46.6718 143.0788 146.2390 171.7175 228.6429 315.6325 330.5011 370.8259 383.6672 407.7080 443.1949 468.3565 522.3056 533.7204 549.0435 618.2122 626.8361 645.8649 681.9093 712.0067 713.5766 753.2212 761.7806 785.8933 815.8361 829.6843 832.8684 862.5767 945.1779 958.6757 972.8381 1005.5552 1101.4410 1107.2707 1156.4334 1198.9152 1203.1047 1226.8253 1287.7995 1296.0406 1309.6334 1313.8364 1353.6167 1380.6873 1399.3868 1492.6974 1592.9359 1611.1526 1665.3492 1691.9083 1715.5942 3075.6113 3146.4499 3147.6371 3174.4374 3177.5860 3599.0915 3602.1787
redmass: 4.0586 10.7287 10.7890 9.0734 5.9932 10.7316 10.0091 8.0894 3.5665 10.1094 4.2104 3.0126 5.4498 4.8317 3.8199 1.1436 5.0530 12.4307 6.5896 1.1200 4.2481 5.5654 9.5602 3.7047 8.7609 5.3096 1.3002 1.9630 1.6069 3.4336 1.3659 1.3549 3.3552 2.7294 1.3168 5.3590 1.4410 1.8420 1.8184 3.3325 1.2561 5.5152 2.3832 1.9676 6.0420 1.7707 3.8215 2.7893 7.8511 6.5497 8.7603 9.2142 8.9786 1.0883 1.0897 1.0893 1.0962 1.0972 1.0801 1.0812
irintensity: 0.6920 0.2981 0.0279 1.7543 0.0170 2.4950 1.4853 0.4802 0.1551 20.7283 3.7660 0.1998 0.0691 12.0156 19.4283 67.0943 17.2548 26.8649 0.0005 160.1986 1.3587 3.2502 26.7405 1.7733 30.6725 31.3980 3.3467 68.1540 34.4179 14.9318 0.1594 0.3622 45.5969 13.5632 12.7231 34.2845 71.5594 66.1365 52.6109 22.3782 1.1100 286.2257 108.0989 16.5725 0.0129 0.3502 1.2030 91.1342 5.1366 28.7925 373.2448 51.4247 572.9947 29.7877 6.9361 7.0445 5.4472 1.9838 101.0803 41.2552
temp: 298.150 k
press: 1.00000 atm
elementType: 9 8 8 7 7 6 6 6 6 6 6 6 6 6 6 1 1 1 1 1 1 1
symmnumber: 1
zpe: 404682.1 jmol-1
zpe.correction: 0.154135 hartree
zpe.thermalcorrener: 0.165629 hartree
zpe.thermalcorrenthalpy: 0.166573 hartree
zpe.thermalcorrgfe: 0.115651 hartree
zpe.sumelectzpe: -744.031022 hartree
zpe.sumelectthermal: -744.019529 hartree
zpe.sumelectthermalent: -744.018584 hartree
zpe.sumelectthermalfe: -744.069507 hartree
dipole: 0.5943 -2.9255 0.0183
dipole: 2.9853
quadrupole: -111.8930 -80.4440 -77.7896
quadrupole: 2.5542 -0.0005 0.0541
quadrupole: -21.8508 9.5982 12.2526 2.5542 -0.0005 0.0541
hfenergy: -744.1851574 hartree
pointgroup: C01 [X(C10H7F1N2O2)]
dipole: 0.2256675 -1.1526171 -0.0001696 debye
dipolederiv: -1.1494491 0.2778201 0.000002 0.3622894 -0.2509978 -0.0002045 0.0000492 -0.0002124 -0.2114655 -0.7518708 0.2972474 -0.0002101 0.1295283 -0.7994461 -0.0000514 0.0002203 0.0002601 -0.2800414 -1.6262456 -0.0328023 -0.0002957 0.0811254 -0.5018702 0.000032 -0.0000432 -0.000044 -0.3630338 -1.4797866 -0.3510624 -0.0002969 -0.2593299 -0.5823607 0.0000305 -0.0006914 0.0000092 -0.3487627 -1.3599517 0.4024024 -0.0003017 0.1876637 -0.6552462 0.0000493 0.0002717 0.0000163 -0.3741508 0.9188687 -0.1070077 0.0002781 -0.5854637 -0.3634891 -0.0001258 -0.0007731 -0.0004148 0.0650271 0.2463899 0.0158989 0.0000657 -0.0612258 -0.0725817 -0.0001956 -0.0009014 -0.0002596 -0.0896877 0.0966801 0.0742524 -0.0000861 -0.2457952 0.1265079 -0.0000236 0.0004421 0.0001797 -0.2129599 1.7153449 -0.2961896 0.0004622 0.3502126 1.0085793 0.0000113 -0.0001453 -0.0000849 0.2466527 2.2971764 0.0190207 0.0004382 0.1110174 1.4028113 0.0000531 0.0002105 0.000247 0.3109566 -0.0890424 -0.0880204 0.0095764 -0.0077576 -0.0852989 0.0261178 -0.0580565 -0.0246023 0.1185987 -0.0876023 -0.0879192 -0.0088294 -0.0054334 -0.085308 -0.0243074 0.0588244 0.0261189 0.1188139 -0.2397457 -0.0029713 -0.0188698 0.0220066 -0.143385 0.01499 -0.1397662 0.0739688 -0.0370758 -0.2402179 -0.0031345 0.0189828 0.0222978 -0.1443037 -0.0142125 0.1405276 -0.073302 -0.0370948 1.2363633 -0.3428191 0.0001232 -0.4155717 0.2138881 0.0005644 -0.0003607 0.0006541 0.2590087 -0.0505587 0.0695929 -0.0000863 0.1348876 -0.0687482 -0.0001478 0.0010126 -0.0001129 0.1669759 0.1597298 -0.037484 -0.0000601 -0.0450923 0.189303 -0.0000669 -0.0000369 -0.0001323 0.3560466 0.1750852 0.0341579 0.0000117 0.0745016 0.2349182 -0.0000065 0.0000053 -0.0000323 0.3680463 0.0743678 0.0470719 -0.0862083 0.0251301 0.1222501 0.0186954 -0.0863035 0.015688 -0.0290116 0.0750229 0.0476622 0.0857643 0.025806 0.1221881 -0.0200079 0.0859469 -0.0167823 -0.0292052 0.0399392 0.0322967 0.0600491 0.0499353 0.1661413 -0.0225515 0.068611 -0.0228362 0.0011783 0.0395026 0.0319871 -0.0605094 0.0492677 0.1664482 0.0213576 -0.0690434 0.0216739 0.0011842 unknown
polarizability: 204.1968942|-7.1302348|92.0325785|0.0729569|0.1447372|92.3624349 unknown
InChI: InChI=1S/C10H7FN2O2/c11-7-3-1-6(2-4-7)5-8-9(14)13-10(15)12-8/h1-5,12-13H
charge 0 multiplicity 1
22 atoms
F  -4.9706 0.681926 0.000118
O  0.74323 1.827764 0.000605
O  5.054784 -0.10573 0.000919
N  2.854364 -1.035855 0.000448
N  3.037556 1.191233 0.00091
C  1.52293 -0.554463 0.000279
C  -1.00852 -0.752857 -0.000362
C  0.381577 -1.302658 -0.000452
C  1.643375 0.956175 0.000825
C  3.807386 -0.002552 0.000834
C  -1.685694 -0.507492 1.222686
C  -1.688959 -0.515679 -1.223216
C  -3.012226 -0.025577 1.232744
C  -3.015492 -0.033741 -1.232967
C  -3.6468 0.201151 -0.000037
H  0.482259 -2.399267 -0.001062
H  3.133845 -2.015219 0.000184
H  3.464245 2.117314 0.001013
H  -1.169594 -0.682285 2.172409
H  -1.175397 -0.696808 -2.173134
H  -3.54237 0.176831 2.167974
H  -3.548101 0.16249 -2.168113
