program: Gaussian 09
title: 000248862
version: EM64L-G09RevD.01
frameworkgroup: C1[X(C11H15N5O5)]
method: RPBEPBE
basis: SDD
operation: Freq
keyword: #p
keyword: freq=noraman
keyword: PBEPBE/SDD
title: #p freq=noraman PBEPBE/SDD
converged: YES YES NO NO
title: Mulliken charges:
elementType: O O O O O N N N N N C C C C C C C C C C C H H H H H H H H H H H H H H H
charge: -0.255429 -0.452498 -0.463468 -0.433938 -0.221608 -0.184223 -0.032973 -0.274466 -0.113756 -0.595669 -0.205307 -0.080225 -0.154788 -0.069080 -0.379686 0.293202 -0.215493 -0.127368 0.171416 0.075011 -0.505541 0.273864 0.243558 0.206633 0.276113 0.238921 0.224612 0.350634 0.400044 0.274124 0.333750 0.348218 0.336315 0.238680 0.240325 0.240098
chargesum: 0.00000
title: Mulliken charges with hydrogens summed into heavy atoms:
elementType: O O O O O N N N N N C C C C C C C C C C C
charge: -0.255429 -0.101864 -0.063425 -0.100188 -0.221608 -0.184223 -0.032973 -0.274466 -0.113756 0.088864 0.068557 0.163333 0.051845 0.207034 0.083848 0.293202 0.058631 -0.127368 0.171416 0.075011 0.213561
polarizability: 2.33697123e+02 -5.52611143e+00 1.85824129e+02 6.67969408e+00 5.21851868e+00 1.04009090e+02
1716.lowfreq: -7.1025 -0.0010 -0.0010 -0.0008 8.2229 9.2582 28.1109 39.4503 58.0630
frequency: 27.7102 39.4242 58.0584 88.4301 102.3611 105.7097 129.5027 144.1510 145.3711 181.1110 185.9225 219.4774 234.6405 241.1646 252.6394 283.0702 287.0319 306.6370 320.9834 332.7973 364.1763 380.8709 414.0124 417.9525 470.3621 492.3596 492.9960 510.3662 516.7610 552.8546 592.2455 631.9124 660.5426 685.6617 692.1309 714.4032 740.1789 775.9816 794.3266 809.9579 833.1337 837.2508 882.4005 902.3482 934.3147 950.8727 960.9779 969.7202 989.6703 996.2693 1010.3331 1032.4863 1049.3291 1056.5274 1067.3863 1081.2768 1112.2524 1143.7727 1151.9377 1163.6094 1173.0359 1198.9565 1211.0343 1222.8220 1241.6281 1266.9503 1274.5071 1289.9986 1291.1217 1314.0975 1334.7689 1341.0919 1346.6091 1369.5365 1370.2780 1390.4030 1404.3884 1440.4186 1450.9215 1452.3268 1461.9715 1472.1961 1506.5811 1554.0864 1568.6463 1611.0723 1623.5552 2627.6666 2986.9433 3000.8277 3005.9098 3021.7599 3030.5509 3069.7333 3102.0941 3109.6909 3150.2155 3231.6088 3553.2212 3562.6660 3577.5498 3710.1853
redmass: 6.2492 5.6166 4.8021 5.2458 4.9022 4.7248 3.0739 2.8452 1.4001 3.5316 4.4019 3.6074 5.1943 7.0740 6.0890 2.3721 1.7685 3.5619 1.4421 4.3233 5.7660 3.7964 5.2706 4.4256 6.0874 2.2168 1.9159 1.4909 2.3604 6.8952 6.6505 5.0368 7.0587 5.2800 5.9094 11.3167 4.5900 4.5896 6.2726 1.7750 2.5595 7.1311 4.1782 7.9284 3.5096 1.1493 3.0301 4.5542 6.0778 4.9275 3.6469 5.1027 3.2003 1.9574 2.5972 2.1611 1.2530 1.3241 1.5800 1.9306 1.5209 1.8991 2.0937 4.1836 1.2611 1.1710 1.2878 3.0946 1.3710 1.2833 1.3682 5.0057 1.5742 1.6409 1.6797 2.4330 2.4794 2.4040 2.1804 1.0548 1.0648 1.0789 2.7157 8.5803 2.2820 1.8874 1.5339 1.0812 1.0674 1.0855 1.0291 1.0872 1.0857 1.0866 1.0986 1.1046 1.1050 1.0987 1.0454 1.0662 1.0664 1.1055
irintensity: 1.7173 0.6362 4.0727 3.2280 1.3686 2.8066 4.8431 3.1664 1.3591 7.9937 0.7455 2.8223 13.1157 6.3438 1.7927 30.9689 131.2922 8.4452 134.0063 25.4759 2.1100 15.2845 12.0681 1.5662 0.9754 121.7040 136.0824 33.6320 13.8052 3.6416 1.4545 21.1841 0.4471 8.0520 24.5332 2.9879 24.7209 16.9092 108.4030 12.4378 7.2431 7.7787 24.3686 8.7451 27.9633 115.6736 126.6299 26.4637 21.9669 153.0076 19.7910 126.0565 30.8381 5.8979 7.2716 11.8637 0.1030 21.9095 17.2725 58.4983 4.4841 4.5091 24.3281 307.6370 2.0564 13.7313 4.4326 9.5410 1.6248 18.0292 21.0572 98.5007 1.6152 22.6109 80.3797 72.7044 15.4043 33.4147 29.8162 14.4130 52.5563 7.5202 70.2333 502.8300 10.5169 242.9436 451.8164 1891.7344 24.7307 32.8908 44.7552 28.7093 17.5819 11.7079 17.9354 26.1915 18.1722 0.3215 130.0454 7.4373 12.1583 61.8314
temp: 298.150 k
press: 1.00000 atm
elementType: 8 8 8 8 8 7 7 7 7 7 6 6 6 6 6 6 6 6 6 6 6 1 1 1 1 1 1 1 1 1 1 1 1 1 1 1
symmnumber: 1
zpe: 720425.5 jmol-1
zpe.correction: 0.274396 hartree
zpe.thermalcorrener: 0.293961 hartree
zpe.thermalcorrenthalpy: 0.294905 hartree
zpe.thermalcorrgfe: 0.226447 hartree
zpe.sumelectzpe: -1076.443072 hartree
zpe.sumelectthermal: -1076.423506 hartree
zpe.sumelectthermalent: -1076.422562 hartree
zpe.sumelectthermalfe: -1076.491021 hartree
dipole: -1.5892 2.6011 3.4090
dipole: 4.5730
quadrupole: -116.3079 -119.6431 -122.7293
quadrupole: -19.0867 14.2293 0.3543
quadrupole: 3.2522 -0.0830 -3.1692 -19.0867 14.2293 0.3543
hfenergy: -1076.7174674 hartree
pointgroup: C01 [X(C11H15N5O5)]
dipole: -0.5300621 -0.8677043 -1.4842838 debye
polarizability: 233.3780341|7.8895413|183.7625998|-1.5609202|15.5802581|106.3897084 unknown
InChI: InChI=1S/C11H15N5O5/c1-20-9-5-8(14-11(12)15-9)16(3-13-5)10-7(19)6(18)4(2-17)21-10/h3-4,6-7,10,17-19H,2,12H2,1H3
charge 0 multiplicity 1
36 atoms
O  1.885394 0.45961 1.378376
O  3.188572 1.589257 -1.396623
O  1.802824 -1.842164 -0.863265
O  5.331934 -1.061572 1.298795
O  -4.567655 0.315272 0.260875
N  -0.013064 1.291413 0.186992
N  -2.120432 2.171815 0.496914
N  -0.636031 -1.067051 -0.262012
N  -3.050999 -1.435128 -0.186565
N  -1.563864 -3.188282 -0.642499
C  2.134089 0.626698 -1.037164
C  1.453872 1.246513 0.216397
C  2.699895 -0.752286 -0.558626
C  2.920725 -0.536407 0.963286
C  4.31414 -0.000487 1.354483
C  -0.907673 0.234439 0.024206
C  -0.80799 2.427225 0.482495
C  -2.206093 0.793173 0.212261
C  -3.28509 -0.129198 0.09169
C  -1.751989 -1.859145 -0.355971
C  -5.654181 -0.684939 0.13895
H  1.427652 0.476469 -1.87556
H  1.799886 2.291471 0.320195
H  3.650066 -0.97879 -1.080583
H  2.709125 -1.466609 1.516914
H  4.292902 0.310509 2.410291
H  4.59078 0.870309 0.726199
H  3.627328 1.293485 -2.233195
H  0.835708 -1.576462 -0.578968
H  -0.356198 3.398726 0.672564
H  5.454224 -1.355522 0.36087
H  -0.623579 -3.555356 -0.773468
H  -2.376815 -3.792878 -0.716179
H  -5.653028 -1.133265 -0.868444
H  -6.570295 -0.105075 0.317623
H  -5.529844 -1.480769 0.891946
