program: Gaussian 09
title: 000248844
version: EM64L-G09RevD.01
frameworkgroup: C1[X(C9H16Cl2N2O2)]
method: RPBEPBE
basis: SDD
operation: Freq
keyword: #p
keyword: freq=noraman
keyword: PBEPBE/SDD
title: #p freq=noraman PBEPBE/SDD
converged: YES YES NO NO
title: Mulliken charges:
elementType: Cl Cl O O N N C C C C C C C C C H H H H H H H H H H H H H H H H
charge: -0.055147 -0.055091 -0.276350 -0.296670 -0.131177 -0.365957 -0.162701 0.239683 -0.328993 -0.384306 -0.700834 -0.582038 -0.598341 0.265788 -0.766043 0.262502 0.277136 0.237271 0.249696 0.249770 0.220313 0.241758 0.236970 0.319288 0.258033 0.305648 0.259811 0.350780 0.257113 0.255112 0.216978
chargesum: 0.00000
title: Mulliken charges with hydrogens summed into heavy atoms:
elementType: Cl Cl O O N N C C C C C C C C C
charge: -0.055147 -0.055091 -0.276350 -0.296670 -0.131177 -0.046670 0.099801 0.239683 0.185414 0.115160 -0.001793 -0.018357 0.012251 0.265788 -0.036840
polarizability: 1.54143996e+02 4.33479870e-01 1.48767071e+02 -9.85010538e-01 1.32365954e+00 1.09988694e+02
1716.lowfreq: -7.0932 -6.4619 -0.0008 0.0010 0.0018 7.1785 23.2174 34.5433 39.6997
frequency: 22.9601 34.5066 39.6884 50.9741 58.1582 70.0788 77.2378 90.9991 98.6168 146.7526 163.0207 205.1878 215.3440 229.3760 231.8546 239.3605 280.4768 310.0639 341.3999 383.1629 413.6335 453.6549 528.0577 563.5916 589.8231 610.9971 622.0888 685.6340 701.1846 726.1920 771.0534 781.7639 799.5614 883.2499 931.4472 956.2421 998.6099 1001.7282 1033.8885 1040.2399 1044.0747 1051.2568 1057.5625 1100.6922 1119.4433 1141.0981 1176.7829 1226.2208 1253.6221 1258.5862 1262.4883 1283.3405 1291.8774 1301.2173 1334.9177 1353.5890 1365.5494 1385.0537 1390.0764 1411.5810 1449.8136 1450.1348 1459.2420 1461.9088 1467.5892 1474.6723 1479.7857 1487.4743 1499.4893 1583.7481 1604.0086 2988.4833 3000.1967 3024.1575 3032.8336 3043.5179 3061.3540 3073.0195 3083.2808 3090.6986 3099.5119 3100.9662 3101.9670 3106.0844 3135.2926 3154.0678 3548.9028
redmass: 5.8811 8.4889 5.9813 5.4803 3.6212 1.4854 3.4659 3.4206 2.7720 2.5433 3.5834 4.7287 5.0712 1.8596 3.7860 1.6997 3.8226 3.4800 4.1922 3.3544 3.8787 3.0860 4.0761 1.6426 3.0410 2.8418 4.7355 5.3969 4.7590 6.6868 2.7564 1.2658 1.1696 1.9207 4.0871 3.0124 1.4927 1.5058 1.4536 4.1161 1.6631 2.5237 2.2266 2.6139 1.4807 2.0666 2.0013 2.3640 1.2974 1.5744 1.2656 1.2563 1.3548 1.3113 1.3890 1.2595 1.2685 1.2929 1.2272 2.1435 1.1017 1.0511 1.1118 1.1935 1.0556 1.2431 1.0888 1.2876 1.1701 6.1610 6.1026 1.0354 1.0359 1.0617 1.0603 1.0576 1.0575 1.0919 1.1022 1.0952 1.0980 1.1047 1.0993 1.1010 1.1127 1.1114 1.0778
irintensity: 2.0694 1.3378 2.1101 1.9793 3.9138 7.2240 3.0693 4.7234 4.1026 6.3011 8.2465 1.7558 1.4695 2.3432 3.1844 0.5613 6.8700 7.7883 10.6252 22.9346 14.3514 4.5160 16.8492 100.9225 16.4353 14.8842 32.5453 24.2504 43.7970 32.5244 2.9040 7.6853 7.6257 0.7692 1.3318 5.1437 3.0551 5.1529 22.9289 0.5480 10.4333 10.1974 4.1962 2.7352 29.2564 69.1647 20.7133 18.0364 36.6178 34.1193 11.3327 11.9068 12.0611 8.0762 37.1590 6.7098 8.2002 40.4087 47.2773 96.6714 9.4964 22.5679 17.3047 99.7934 9.5179 73.5588 14.9339 24.7654 63.0196 250.8541 185.1173 18.6324 9.0854 17.5229 11.4528 25.5922 17.3395 1.6026 25.4946 18.7913 8.1505 3.1251 16.7795 18.6566 15.2664 6.4848 26.1847
temp: 298.150 k
press: 1.00000 atm
elementType: 17 17 8 8 7 7 6 6 6 6 6 6 6 6 6 1 1 1 1 1 1 1 1 1 1 1 1 1 1 1 1
symmnumber: 1
zpe: 653478.6 jmol-1
zpe.correction: 0.248897 hartree
zpe.thermalcorrener: 0.267153 hartree
zpe.thermalcorrenthalpy: 0.268097 hartree
zpe.thermalcorrgfe: 0.198987 hartree
zpe.sumelectzpe: -1531.463875 hartree
zpe.sumelectthermal: -1531.445619 hartree
zpe.sumelectthermalent: -1531.444675 hartree
zpe.sumelectthermalfe: -1531.513785 hartree
dipole: -1.7323 -2.2479 2.0152
dipole: 3.4807
quadrupole: -112.8839 -116.6264 -98.7687
quadrupole: 18.4310 2.8352 -1.1658
quadrupole: -3.4576 -7.2001 10.6577 18.4310 2.8352 -1.1658
hfenergy: -1531.7127723 hartree
pointgroup: C01 [X(C9H16Cl2N2O2)]
dipole: 0.7794602 0.6634405 0.9096897 debye
polarizability: 153.7578322|-0.8325003|148.8006749|3.9121731|1.588345|110.3412527 unknown
InChI: InChI=1S/C9H16Cl2N2O2/c1-7(12-8(2)14)9(15)13(5-3-10)6-4-11/h7,12H,3-6H2,1-2H3
charge 0 multiplicity 1
31 atoms
Cl -4.846199 1.67197 -0.844136
Cl -0.645371 -4.145792 -0.165461
O  -0.248502 2.092938 0.076527
O  2.608924 -1.121023 -0.701176
N  -1.176651 -0.037846 0.0634
N  2.281664 0.852964 0.482036
C  1.076285 0.359597 1.167821
C  -0.168878 0.861894 0.390231
C  -2.322542 0.477691 -0.730472
C  -1.179366 -1.478214 0.419121
C  1.019357 0.876282 2.621811
C  -3.358781 1.141041 0.190074
C  -0.466416 -2.327298 -0.650412
C  2.95453 0.077892 -0.449403
C  4.137425 0.743271 -1.139651
H  1.154758 -0.737868 1.151187
H  -1.951578 1.221789 -1.45442
H  -2.781561 -0.361161 -1.281343
H  -0.710804 -1.642055 1.403657
H  -2.229195 -1.808662 0.512603
H  0.135874 0.471134 3.14735
H  1.924364 0.5653 3.170983
H  0.946044 1.978647 2.638554
H  2.467169 1.856739 0.536717
H  -3.756463 0.451744 0.95041
H  -2.961964 2.057448 0.647703
H  -0.941195 -2.234447 -1.638849
H  0.614216 -2.12384 -0.70971
H  5.039822 0.129495 -0.977318
H  3.952715 0.769846 -2.22753
H  4.332521 1.769027 -0.783802
