program: Gaussian 09
title: 000248845
version: EM64L-G09RevD.01
frameworkgroup: C1[X(C11H18Cl4N2O2S)]
method: RPBEPBE
basis: SDD
operation: Freq
keyword: #p
keyword: freq=noraman
keyword: PBEPBE/SDD
title: #p freq=noraman PBEPBE/SDD
converged: YES YES NO NO
title: Mulliken charges:
elementType: Cl Cl Cl Cl S O O N N C C C C C C C C C C C H H H H H H H H H H H H H H H H H H
charge: -0.047887 -0.043847 0.039601 0.025889 0.185269 -0.260332 -0.262173 -0.130279 -0.344648 -0.152939 -0.350811 0.205804 -0.329343 -0.385182 -0.716144 -0.582088 -0.594005 0.380353 -0.716725 -0.839489 0.254892 0.222873 0.252590 0.280491 0.238381 0.248404 0.255127 0.251039 0.283801 0.342753 0.305894 0.257813 0.332937 0.266017 0.358418 0.255323 0.260574 0.251648
chargesum: 0.00000
title: Mulliken charges with hydrogens summed into heavy atoms:
elementType: Cl Cl Cl Cl S O O N N C C C C C C C C C C C
charge: -0.047887 -0.043847 0.039601 0.025889 0.185269 -0.260332 -0.262173 -0.130279 -0.001895 0.101954 0.124652 0.205804 0.189529 0.118350 -0.181304 -0.018381 0.004949 0.380353 -0.358307 -0.071944
polarizability: 2.14610532e+02 -7.88382022e+00 1.84688465e+02 6.20636074e-01 7.84699357e+00 1.90810867e+02
1716.lowfreq: -7.8829 -6.5243 -5.3192 -0.0021 -0.0006 0.0006 13.6880 15.2204 19.8232
frequency: 13.5627 14.9493 19.7860 23.0001 29.1332 32.2421 38.9013 47.3622 61.7080 74.4520 87.2450 92.4484 104.4147 119.5707 137.7258 144.3194 157.5628 166.7715 210.9810 219.8593 224.6702 234.9323 247.4529 259.9849 287.1033 321.8618 341.0637 347.4154 387.4183 404.8351 468.8391 525.8947 588.9602 609.7163 632.4804 639.7459 650.7903 685.1699 702.5289 704.4316 711.6472 723.8753 749.8013 753.9095 782.4184 796.7678 842.5463 898.2591 946.1717 959.0567 961.3347 985.4579 1001.1308 1035.0802 1039.0226 1044.1528 1053.0926 1070.3048 1100.0841 1118.7287 1146.1424 1182.8761 1190.8781 1208.6925 1224.5535 1233.7733 1245.3962 1257.1440 1263.0284 1278.7057 1284.5972 1290.9871 1302.4654 1323.6926 1339.6349 1343.2793 1353.7334 1362.1120 1408.2809 1440.7947 1450.0798 1450.6328 1458.7594 1461.2286 1465.6916 1475.5249 1488.5558 1503.0770 1586.1666 1606.3095 2993.7158 3001.2392 3011.3675 3026.7001 3033.9626 3050.8882 3051.2304 3060.1817 3076.2323 3085.6249 3091.2222 3102.2521 3114.8222 3128.8071 3139.7164 3152.5928 3165.0240 3502.0108
redmass: 14.5801 9.3692 10.7411 4.1302 7.1107 8.8717 17.5861 11.7031 3.7709 2.9984 3.3730 5.1320 5.0360 1.8325 2.2712 2.2883 7.4166 6.4196 3.2684 4.3881 8.5192 4.3950 8.2684 5.0046 4.6190 4.2141 5.0662 4.9468 11.4225 3.2450 4.2074 4.6101 7.2228 2.0695 2.4654 5.1982 5.4961 6.8506 5.4066 5.1470 4.9905 5.5441 8.4886 1.2882 1.1984 1.1622 4.9376 1.8458 3.8114 1.6602 1.4862 1.7381 1.5140 1.7995 3.8205 2.6076 3.9313 2.1821 3.0348 1.4885 1.3825 1.5901 1.0739 1.3026 2.2424 1.2319 1.7079 1.2071 1.2419 1.2202 1.3046 1.1891 1.2373 1.3524 1.3204 1.1898 1.2640 1.2678 2.5030 1.0775 1.0985 1.0647 1.1033 1.0775 1.1284 1.0919 1.3958 1.3263 6.1860 9.2290 1.0607 1.0301 1.0591 1.0610 1.0602 1.0689 1.0864 1.0575 1.0908 1.1001 1.1034 1.1049 1.1055 1.1021 1.1126 1.1115 1.0896 1.0777
irintensity: 0.1389 0.2145 0.1630 0.6169 1.1953 0.7397 0.3778 6.9760 1.3495 3.0230 4.3505 2.4545 2.0022 1.8166 1.5728 0.6253 5.9826 3.8970 1.9148 3.3764 2.9646 4.0601 2.3284 2.2944 2.4339 9.4672 43.6845 4.5180 11.0437 11.7455 4.5223 14.3446 44.3819 17.5945 117.3500 89.6552 13.3146 5.0656 22.2740 51.2619 9.9437 66.0293 31.3957 14.7696 10.4134 5.6314 5.2426 5.1438 1.0209 3.2060 2.9226 9.2010 4.9481 4.4399 1.1191 5.5905 2.8843 4.1040 18.4566 31.6538 61.1921 11.4670 9.7401 16.8242 13.6710 12.8458 16.8887 17.9515 9.6215 10.7886 14.2021 0.9107 22.8059 7.5347 10.6460 2.6371 7.4833 8.1300 150.3715 1.5303 22.6738 10.3788 17.0426 3.0962 83.1980 17.3407 44.2886 134.0361 237.0771 214.7379 11.1130 26.6104 24.1299 11.9737 9.9550 9.5305 7.4014 17.8441 11.1645 12.3197 14.1511 1.6415 22.9422 11.1407 8.0259 6.0469 0.2613 46.4798
temp: 298.150 k
press: 1.00000 atm
elementType: 17 17 17 17 16 8 8 7 7 6 6 6 6 6 6 6 6 6 6 6 1 1 1 1 1 1 1 1 1 1 1 1 1 1 1 1 1 1
symmnumber: 1
zpe: 753937.6 jmol-1
zpe.correction: 0.287160 hartree
zpe.thermalcorrener: 0.312334 hartree
zpe.thermalcorrenthalpy: 0.313278 hartree
zpe.thermalcorrgfe: 0.223682 hartree
zpe.sumelectzpe: -2926.655165 hartree
zpe.sumelectthermal: -2926.629990 hartree
zpe.sumelectthermalent: -2926.629046 hartree
zpe.sumelectthermalfe: -2926.718643 hartree
dipole: 1.2472 1.7595 1.1408
dipole: 2.4399
quadrupole: -173.0547 -148.8263 -178.6565
quadrupole: 7.8322 5.6277 3.8581
quadrupole: -6.2088 18.0195 -11.8107 7.8322 5.6277 3.8581
hfenergy: -2926.9423243 hartree
pointgroup: C01 [X(C11H18Cl4N2O2S1)]
dipole: -0.6411821 0.5517536 -0.4537499 debye
polarizability: 208.6039569|14.3736787|190.8260136|3.2923209|-7.0937526|190.6798941 unknown
InChI: InChI=1S/C11H18Cl4N2O2S/c1-20-7-2-8(16-10(18)9(14)15)11(19)17(5-3-12)6-4-13/h8-9,16H,2-7H2,1H3
charge 0 multiplicity 1
38 atoms
Cl -5.36592 -1.823944 2.076598
Cl -1.774413 -1.007572 -4.110756
Cl 4.896321 0.082781 0.128482
Cl 3.54456 -2.031574 1.908394
S  1.158662 4.689298 0.730509
O  -0.805217 -0.598873 2.054038
O  1.957095 -1.014575 -1.521767
N  -1.934839 -0.724352 0.023943
N  1.544832 -0.057178 0.57229
C  0.256087 0.541856 0.185818
C  0.147447 2.007752 0.691068
C  -0.873459 -0.308282 0.817898
C  -2.971786 -1.578028 0.662627
C  -2.097064 -0.399719 -1.414414
C  1.231376 2.916453 0.084125
C  -4.009325 -0.708766 1.390651
C  -1.374309 -1.421701 -2.312684
C  2.288236 -0.787635 -0.315778
C  3.642447 -1.308168 0.180769
C  -0.364084 5.302268 -0.194377
H  0.232638 0.519149 -0.915043
H  -0.85911 2.389469 0.430459
H  0.214184 2.018362 1.795236
H  -2.484887 -2.249582 1.388632
H  -3.462023 -2.186678 -0.116477
H  -1.733729 0.618285 -1.633101
H  -3.175951 -0.404686 -1.650156
H  1.163046 2.954128 -1.018407
H  2.242056 2.562516 0.350376
H  1.775143 -0.083087 1.571609
H  -3.568166 -0.194316 2.255256
H  -4.516482 -0.000551 0.717888
H  -0.277909 -1.374932 -2.225378
H  -1.738902 -2.447041 -2.15048
H  4.017456 -2.09617 -0.481015
H  -0.250955 5.109447 -1.273882
H  -0.411251 6.388852 -0.022461
H  -1.283603 4.833093 0.18931
