program: Gaussian 09
title: 000248830
version: EM64L-G09RevD.01
frameworkgroup: C1[X(C10H20O2S)]
method: RPBEPBE
basis: SDD
operation: Freq
keyword: #p
keyword: freq=noraman
keyword: PBEPBE/SDD
title: #p freq=noraman PBEPBE/SDD
converged: YES YES NO NO
title: Mulliken charges:
elementType: S O O C C C C C C C C C C H H H H H H H H H H H H H H H H H H H H
charge: 0.177354 -0.420363 -0.226026 -0.376169 -0.370813 -0.368224 -0.352538 -0.339434 -0.356262 -0.683382 -0.695632 -0.728078 0.275685 0.193834 0.192955 0.189413 0.189412 0.194049 0.192416 0.188396 0.188500 0.210721 0.215548 0.194831 0.194929 0.288519 0.251055 0.209984 0.210007 0.215649 0.275632 0.286891 0.381141
chargesum: 0.00000
title: Mulliken charges with hydrogens summed into heavy atoms:
elementType: S O O C C C C C C C C C C
charge: 0.177354 -0.039222 -0.226026 0.010620 0.008012 0.018241 0.024358 0.086835 0.033498 -0.143809 -0.059992 -0.165555 0.275685
polarizability: 1.87421791e+02 -7.33120408e-01 1.16917617e+02 4.47111787e+00 2.58426268e+00 1.04684783e+02
1716.lowfreq: -30.7272 -6.3070 -3.5081 0.0003 0.0007 0.0014 12.6047 22.1472 36.0551
frequency: -22.8833 21.5851 35.9890 38.2776 57.8720 71.3922 87.5417 109.1666 117.2093 135.5770 142.0096 153.3084 200.1495 202.4337 228.2989 301.1068 345.6484 397.9464 437.5967 472.9048 507.5228 578.3036 644.8862 694.2552 718.8464 727.2164 734.0408 748.3656 784.3141 829.6136 847.8045 884.0900 888.8419 923.8244 987.7489 996.0494 1017.8037 1038.0066 1056.8243 1067.4414 1068.6084 1075.5585 1079.8287 1119.2032 1173.0124 1183.9463 1213.5554 1217.3266 1234.6437 1248.6598 1253.1905 1276.9141 1279.1092 1281.6341 1289.4078 1293.0701 1305.2532 1317.8198 1343.0016 1352.4028 1353.3307 1388.9608 1421.1344 1457.9191 1460.9923 1462.3173 1465.7469 1471.2457 1476.7125 1478.2762 1484.8545 1488.5507 1667.3149 2950.3822 2952.5948 2956.1977 2962.5089 2968.0954 2971.7074 2978.8619 2984.9769 2993.8177 3004.9951 3009.3281 3020.6788 3034.3499 3045.8572 3054.3387 3068.0201 3070.7156 3094.7237 3144.3497 3515.7900
redmass: 1.8459 4.1094 4.9212 4.4474 3.2240 2.1977 3.1775 2.1606 3.2213 2.3504 2.0146 5.5344 4.1800 6.4896 1.1191 3.5549 3.6776 2.3981 3.0643 3.0607 4.1561 2.2376 1.9143 5.2404 1.0625 1.0900 5.4652 1.1216 1.1636 5.1443 1.2186 1.9712 1.8958 1.2137 4.8339 1.1419 3.7788 3.0244 1.9879 1.1239 2.5935 2.4089 2.1820 2.5951 1.2180 1.7978 1.2558 1.4629 1.1863 1.2524 1.2979 1.0297 1.2006 1.2707 1.0748 1.1429 2.0076 1.3741 1.4629 1.6023 1.6493 1.2166 1.1093 1.0842 1.0721 1.0735 1.0685 1.0800 1.0426 1.0804 1.0881 1.0929 8.5607 1.0588 1.0587 1.0590 1.0590 1.0587 1.0364 1.0591 1.0968 1.0990 1.1007 1.0605 1.1030 1.1040 1.1041 1.0590 1.1007 1.0993 1.1069 1.1066 1.0640
irintensity: 0.0234 0.4778 1.1118 0.2225 0.2241 0.1440 0.2178 0.3716 0.7738 0.1214 0.2228 0.4833 0.1703 2.0701 0.0004 1.6601 2.9636 2.4537 0.1337 1.0521 36.3660 51.4591 114.5313 7.6629 13.9600 0.5793 6.9497 6.3327 0.2639 25.5787 1.1137 1.9849 7.3904 0.1053 0.9058 0.6804 0.2710 12.4006 126.2101 6.7609 31.7048 0.8079 1.7629 12.5944 31.6865 0.5091 8.6898 0.6615 1.6785 3.5097 0.4706 0.3001 0.1111 6.4319 0.1379 1.5031 29.5784 7.8367 6.3448 0.1651 0.4379 11.2435 23.9778 2.5039 0.0135 1.2824 1.0997 1.2760 12.4453 1.1776 2.5272 29.2775 308.2247 0.0248 1.5448 0.6949 16.0136 134.8527 37.2139 49.6987 0.1444 0.2147 1.2049 27.8364 0.8360 30.4453 131.7561 12.0039 96.1417 54.4812 24.4307 0.7864 22.6919
temp: 298.150 k
press: 1.00000 atm
elementType: 16 8 8 6 6 6 6 6 6 6 6 6 6 1 1 1 1 1 1 1 1 1 1 1 1 1 1 1 1 1 1 1 1
symmnumber: 1
zpe: 745857.3 jmol-1
zpe.correction: 0.284082 hartree
zpe.thermalcorrener: 0.300555 hartree
zpe.thermalcorrenthalpy: 0.301499 hartree
zpe.thermalcorrgfe: 0.236788 hartree
zpe.sumelectzpe: -940.502053 hartree
zpe.sumelectthermal: -940.485580 hartree
zpe.sumelectthermalent: -940.484636 hartree
zpe.sumelectthermalfe: -940.549347 hartree
dipole: 2.4014 1.2728 1.8697
dipole: 3.2989
quadrupole: -105.5633 -85.9847 -90.0745
quadrupole: -3.2549 -10.0596 -2.6731
quadrupole: -11.6892 7.8895 3.7997 -3.2549 -10.0596 -2.6731
hfenergy: -940.7861349 hartree
pointgroup: C01 [X(C10H20O2S1)]
dipole: 0.941619 0.886197 0.1119615 debye
polarizability: 187.4099118|3.1321794|112.6586955|3.4167203|-6.3729623|108.9555837 unknown
InChI: InChI=1S/C10H20O2S/c1-2-3-4-5-6-7-8-13-9-10(11)12/h11H,2-9H2,1H3
charge 0 multiplicity 1
33 atoms
S  -2.997024 -1.065301 0.872022
O  -4.033852 1.349732 -1.231496
O  -5.832487 -0.124861 -1.247508
C  2.303698 -0.446878 0.179682
C  3.522205 0.484371 -0.011259
C  0.966009 0.318256 0.299689
C  4.8614 -0.277927 -0.128429
C  -0.247984 -0.623796 0.489122
C  6.080544 0.652725 -0.321954
C  -1.56696 0.158852 0.59948
C  7.414002 -0.117161 -0.437363
C  -4.470478 0.131601 0.798914
C  -4.884414 0.402084 -0.627826
H  2.246183 -1.154766 -0.673235
H  2.454593 -1.065928 1.088589
H  3.578542 1.194208 0.8406
H  3.372332 1.102444 -0.921386
H  0.814546 0.936906 -0.609133
H  1.023368 1.024178 1.154189
H  5.01417 -0.894734 0.782051
H  4.806643 -0.989123 -0.979227
H  -0.097053 -1.236416 1.400535
H  -0.305787 -1.327425 -0.364755
H  5.927696 1.268099 -1.232194
H  6.134395 1.363553 0.527929
H  -1.785487 0.72467 -0.321112
H  -1.549459 0.852081 1.459793
H  7.395705 -0.813745 -1.296898
H  7.606379 -0.715316 0.473438
H  8.268972 0.569717 -0.577178
H  -4.185428 1.060559 1.31691
H  -5.293047 -0.368558 1.329279
H  -4.310324 1.472597 -2.180168
