program: Gaussian 09
title: 000248834
version: EM64L-G09RevD.01
frameworkgroup: C1[X(C14H16N2O)]
method: RPBEPBE
basis: SDD
operation: Freq
keyword: #p
keyword: freq=noraman
keyword: PBEPBE/SDD
title: #p freq=noraman PBEPBE/SDD
converged: YES YES NO NO
title: Mulliken charges:
elementType: O N N C C C C C C C C C C C C C C H H H H H H H H H H H H H H H H
charge: -0.243875 -0.015742 -0.409594 0.141189 -0.493938 0.065703 -0.395837 -0.566105 -0.515710 -0.396489 0.424164 0.177886 -0.389700 -0.398747 -0.240806 -0.246389 -0.242664 0.207889 0.204681 0.217055 0.206734 0.249570 0.261193 0.233868 0.239193 0.213061 0.204835 0.258672 0.224873 0.338521 0.228525 0.226530 0.231456
chargesum: 0.00000
title: Mulliken charges with hydrogens summed into heavy atoms:
elementType: O N N C C C C C C C C C C C C C C
charge: -0.243875 -0.015742 -0.071073 0.141189 -0.081367 0.065703 0.027951 -0.055343 -0.042649 0.021407 0.424164 0.177886 -0.131029 -0.173873 -0.012282 -0.019859 -0.011208
polarizability: 1.68364136e+02 -7.52091726e-01 1.58843066e+02 -2.61617015e+00 4.05563011e+00 1.44998424e+02
1716.lowfreq: -7.5206 -0.0003 0.0002 0.0004 5.8382 13.4980 25.1126 51.9411 93.3412
frequency: 24.8822 51.9335 93.3342 106.8879 145.2959 164.5102 238.5496 262.4355 266.0627 315.9654 362.5437 378.2044 401.4211 404.4149 421.5887 454.9394 466.6416 472.0146 525.9783 538.9799 616.5947 618.3526 648.1918 667.9202 691.5940 704.4465 724.2779 769.0748 776.1003 819.9743 842.7784 854.0455 872.4847 903.3572 922.1761 928.7319 970.2643 979.7874 980.8894 990.6405 998.3906 1029.0779 1051.2239 1053.9720 1082.1084 1095.0434 1097.7232 1120.6709 1132.8730 1153.8933 1171.6672 1175.4975 1199.7049 1219.8299 1248.4214 1254.0606 1286.4920 1300.8552 1303.0247 1325.5902 1327.4763 1339.4670 1345.7403 1347.5477 1376.1744 1400.5078 1434.4031 1438.4696 1448.9603 1464.9079 1469.6219 1479.5467 1484.6298 1588.5207 1593.9730 1610.0419 1631.2563 2955.4310 2974.8015 2980.4368 2981.7132 2984.4202 3038.5512 3040.7391 3051.5880 3065.5998 3083.2413 3122.4907 3127.4265 3139.5379 3147.9484 3164.7024 3553.9725
redmass: 3.7494 5.8645 4.8142 4.7480 2.8878 3.1235 4.1557 2.9425 2.7521 3.1288 2.5451 4.4844 3.5773 3.6225 4.1182 2.8590 3.6001 3.8398 2.6288 3.0978 5.5251 3.4002 3.4387 5.4258 1.3590 1.8883 3.1791 2.3500 2.1961 1.9094 2.9808 1.2613 2.5834 1.5894 1.5637 1.9454 2.3366 1.3887 2.3893 5.5225 1.3408 2.3834 2.9766 2.6414 2.2416 2.2360 1.6821 2.6659 1.3336 1.5734 1.9415 1.1024 1.1216 1.7387 1.5984 1.4701 1.5759 1.6124 3.9491 1.4659 1.4142 1.4619 1.5282 1.4968 6.8818 1.3996 2.2037 1.0911 1.0912 1.0867 1.1006 1.3353 1.5344 6.2481 7.5558 6.0655 6.2653 1.0678 1.0658 1.0644 1.0602 1.0632 1.0967 1.0995 1.1023 1.0941 1.0941 1.0844 1.0869 1.0914 1.0959 1.1015 1.0784
irintensity: 0.1900 1.3596 0.5833 0.5483 0.1370 0.7580 0.5735 0.8048 1.3199 1.0477 2.9798 3.5913 1.4336 1.0417 5.4997 2.5889 7.4394 3.0563 10.0754 4.3909 1.1152 7.0207 13.8066 1.9605 124.3360 28.1133 47.1836 18.4857 8.1784 7.4845 0.2128 0.1938 13.9842 8.4814 1.7663 10.8140 5.2599 0.0713 17.4166 1.8471 0.0217 9.6166 23.0968 13.5497 0.9805 6.8887 6.0497 7.4589 5.9052 6.7283 8.5520 0.6036 0.9903 13.4974 0.9731 27.4059 3.9060 2.1418 112.9682 0.3729 3.9105 0.2185 1.5045 1.7031 0.7856 4.0305 7.4014 7.7514 13.6541 10.5493 12.0670 36.8779 6.0059 7.7972 13.0616 9.1480 329.1917 15.2205 1.0244 47.1437 37.9333 30.1575 37.3317 53.2583 56.7201 28.5282 7.9695 3.6158 0.0947 12.7045 35.7215 22.8369 39.5985
temp: 298.150 k
press: 1.00000 atm
elementType: 8 7 7 6 6 6 6 6 6 6 6 6 6 6 6 6 6 1 1 1 1 1 1 1 1 1 1 1 1 1 1 1 1
symmnumber: 1
zpe: 716995.2 jmol-1
zpe.correction: 0.273089 hartree
zpe.thermalcorrener: 0.287116 hartree
zpe.thermalcorrenthalpy: 0.288061 hartree
zpe.thermalcorrgfe: 0.231867 hartree
zpe.sumelectzpe: -726.569353 hartree
zpe.sumelectthermal: -726.555326 hartree
zpe.sumelectthermalent: -726.554382 hartree
zpe.sumelectthermalfe: -726.610575 hartree
dipole: 0.7518 -4.1734 -0.0681
dipole: 4.2411
quadrupole: -94.5781 -114.3800 -94.9129
quadrupole: 2.9914 0.9882 7.7871
quadrupole: 6.7123 -13.0897 6.3774 2.9914 0.9882 7.7871
hfenergy: -726.8424424 hartree
pointgroup: C01 [X(C14H16N2O1)]
dipole: 0.2421662 1.6367696 0.2157436 debye
polarizability: 168.344429|0.8233856|157.765405|2.4000149|5.6229359|146.0957914 unknown
InChI: InChI=1S/C14H16N2O/c17-13-10-14(11-6-2-1-3-7-11)9-5-4-8-12(14)15-16-13/h1-3,6-7,16H,4-5,8-10H2
charge 0 multiplicity 1
33 atoms
O  -0.985226 -3.592945 0.388345
N  -2.023549 -0.560464 -1.358417
N  -1.77426 -1.899428 -0.986911
C  -0.557915 0.137399 0.583483
C  -0.876549 1.229849 1.660704
C  -1.45464 0.388887 -0.640713
C  -0.842019 2.67065 1.11149
C  -0.894589 -1.261527 1.203112
C  -1.627436 1.808751 -1.145684
C  -1.889688 2.831316 -0.012305
C  0.936335 0.159126 0.14829
C  -1.177134 -2.359908 0.186878
C  1.318551 -0.054414 -1.201214
C  1.96515 0.313404 1.115362
C  2.680442 -0.096765 -1.575952
C  3.326702 0.272365 0.744829
C  3.692661 0.069613 -0.605528
H  -0.189808 1.118046 2.519702
H  -1.89553 1.030715 2.051047
H  0.168425 2.907105 0.723178
H  -1.047654 3.383567 1.932543
H  -1.808701 -1.174192 1.826126
H  -0.082554 -1.606412 1.863607
H  -0.688415 2.103824 -1.661104
H  -2.429764 1.818517 -1.903281
H  -1.863808 3.855441 -0.429302
H  -2.90407 2.674626 0.40602
H  0.549967 -0.196857 -1.969347
H  1.713052 0.464741 2.170952
H  -2.116894 -2.586864 -1.660734
H  2.947993 -0.265683 -2.625081
H  4.101114 0.395771 1.510429
H  4.749011 0.036443 -0.894025
