program: Gaussian 09
title: 000248838
version: EM64L-G09RevD.01
frameworkgroup: C1[X(C17H18N6)]
method: RPBEPBE
basis: SDD
operation: Freq
keyword: #pfreq=noraman
keyword: PBEPBE/SDD
title: #p freq=noraman PBEPBE/SDD
converged: YES YES NO NO
title: Mulliken charges:
elementType: N N N N N N C C C C C C C C C C C C C C C C C H H H H H H H H H H H H H H H H H H
charge: -0.142625 -0.162382 -0.162534 -0.145550 -0.592127 -0.592132 -0.549576 -0.549732 0.501088 0.501036 0.198291 -0.440908 -0.440602 -0.369949 -0.370126 -0.223602 -0.223700 -0.232236 -0.232156 -0.244080 -0.244046 0.033305 0.033254 0.231518 0.272950 0.272781 0.231471 0.232175 0.232237 0.254319 0.254436 0.224659 0.224664 0.224549 0.224537 0.227023 0.227025 0.330356 0.328021 0.328008 0.330359
chargesum: 0.00000
title: Mulliken charges with hydrogens summed into heavy atoms:
elementType: N N N N N N C C C C C C C C C C C C C C C C C
charge: -0.142625 -0.162382 -0.162534 -0.145550 0.066250 0.066235 -0.045107 -0.045479 0.501088 0.501036 0.198291 -0.208733 -0.208365 -0.115630 -0.115689 0.001057 0.000964 -0.007687 -0.007619 -0.017057 -0.017021 0.033305 0.033254
polarizability: 3.00574002e+02 5.92810453e-03 2.29104941e+02 -8.67548845e-02 9.93068904e+00 1.54705176e+02
1716.lowfreq: -7.9343 -5.6231 0.0002 0.0006 0.0009 4.9262 17.1846 17.5429 21.5576
frequency: 17.1045 17.4271 21.3595 28.4018 37.5394 48.5996 102.5168 136.0626 161.2520 188.4390 188.6790 197.1048 227.6409 241.9025 289.6468 323.7011 327.7136 375.2110 402.9733 402.9872 429.4500 449.3074 461.7028 462.1277 481.2139 537.0675 538.7689 540.2645 541.1866 585.9066 593.1034 615.9080 616.2182 623.0623 656.7874 702.1080 705.9133 707.1158 708.0411 746.0935 758.7401 790.5554 804.3515 814.5988 855.6062 857.7572 873.3753 897.6564 913.7243 913.9107 950.7684 956.1887 978.3372 979.6631 990.1079 990.4022 995.4503 995.7860 1006.9989 1016.5189 1026.0733 1026.6374 1084.8932 1085.0304 1123.0335 1158.3452 1165.8603 1171.2445 1171.4863 1186.6580 1187.0983 1210.8862 1211.4088 1268.2297 1278.1311 1281.8373 1323.3230 1328.6828 1357.7226 1359.2087 1383.7115 1386.3825 1416.4412 1438.1333 1441.6044 1455.3549 1461.9263 1462.3544 1483.0930 1483.5414 1506.4739 1516.4549 1535.4210 1593.3774 1593.6907 1594.6183 1613.3327 1613.4631 1628.3237 2993.4312 2996.5473 3067.1793 3067.9568 3113.2402 3114.5624 3122.3919 3122.6450 3134.1940 3134.3921 3144.7866 3144.9652 3161.2303 3161.3772 3558.6297 3560.2492 3720.6442 3720.8826
redmass: 5.3957 4.2965 3.7042 4.7895 5.1592 4.7843 4.9181 7.2802 4.8020 5.3390 4.8899 7.8004 4.3061 4.7674 2.9869 2.9092 5.1987 1.7959 2.8132 2.8158 2.5074 1.1991 3.3812 1.2369 3.2790 5.9258 1.0891 1.0395 4.8340 5.5153 5.9811 5.7777 6.1681 4.0520 4.3359 4.6392 2.0871 6.6317 2.1060 1.9436 2.0381 11.3732 3.4883 3.8720 1.2486 1.2540 3.3281 13.4241 1.4980 1.4548 2.0054 1.8691 1.3978 1.3922 6.0171 5.7376 1.3295 1.3460 3.7298 2.0631 2.2075 2.1588 1.6066 1.5625 2.4093 2.0005 2.7377 1.0671 1.0602 1.1159 1.1155 2.9247 2.7724 1.6517 6.6189 1.6446 1.2865 1.3254 1.3844 1.4122 6.4952 4.8379 5.0478 2.2135 2.1299 1.4666 1.1406 2.0750 2.1930 2.1224 4.7157 4.3528 2.3267 1.4330 5.8520 5.9366 6.0265 5.6973 2.3033 1.0631 1.0633 1.0972 1.0986 1.0869 1.0865 1.0862 1.0864 1.0915 1.0915 1.0961 1.0962 1.1015 1.1015 1.0438 1.0442 1.1059 1.1058
irintensity: 0.0205 0.0430 0.0015 0.0077 0.0193 0.8345 0.0098 3.1825 0.6091 15.7655 0.0765 0.3403 1.8446 0.0824 8.6240 5.7036 2.6787 12.0920 0.1157 0.0550 2.7174 0.0191 0.3653 557.9134 21.7087 4.9631 6.7231 0.2540 0.8142 12.6040 0.0586 6.1458 0.9404 25.6935 0.1263 28.6644 0.4300 0.0043 84.3916 0.0205 62.1129 35.2232 0.5483 24.0419 0.4494 0.5622 10.1630 2.0334 14.9822 6.2821 59.9040 17.4661 0.0513 0.3005 0.3539 0.0790 0.0243 1.2595 0.8245 0.7283 9.2958 8.0646 25.6585 8.6533 0.4863 12.9661 11.1217 0.0780 0.2856 0.6989 3.6615 2.9030 13.9602 10.6776 0.1002 179.1901 5.6348 39.6431 3.8304 11.5239 36.0661 0.5028 1.5134 94.4496 4.7170 2.7702 37.3576 0.0583 14.3436 22.0919 614.9907 1110.4697 495.4896 590.7839 9.4393 12.6348 10.0915 14.9290 146.7789 30.2690 53.7362 15.7166 10.5540 18.3352 0.1158 0.0803 0.0386 33.4616 0.0850 8.5214 64.2613 41.2370 14.1908 125.8167 76.3376 20.5784 68.7447
temp: 298.150 k
press: 1.00000 atm
elementType: 7 7 7 7 7 7 6 6 6 6 6 6 6 6 6 6 6 6 6 6 6 6 6 1 1 1 1 1 1 1 1 1 1 1 1 1 1 1 1 1 1
symmnumber: 1
zpe: 863888.6 jmol-1
zpe.correction: 0.329038 hartree
zpe.thermalcorrener: 0.349121 hartree
zpe.thermalcorrenthalpy: 0.350065 hartree
zpe.thermalcorrgfe: 0.276494 hartree
zpe.sumelectzpe: -985.533889 hartree
zpe.sumelectthermal: -985.513807 hartree
zpe.sumelectthermalent: -985.512862 hartree
zpe.sumelectthermalfe: -985.586433 hartree
dipole: 0.5710 0.0006 0.0016
dipole: 0.5710
quadrupole: -112.8648 -124.7776 -128.8925
quadrupole: 0.0027 -0.0291 -1.3501
quadrupole: 9.3134 -2.5993 -6.7142 0.0027 -0.0291 -1.3501
hfenergy: -985.8629271 hartree
pointgroup: C01 [X(C17H18N6)]
dipole: -0.0015729 -0.2246421 -0.0009266 debye
polarizability: 229.9364033|0.4038467|300.5716537|6.0207226|0.081226|153.8760628 unknown
InChI: InChI=1S/C17H18N6/c18-15-20-16(19)22-17(21-15)23(11-13-7-3-1-4-8-13)12-14-9-5-2-6-10-14/h1-10H,11-12,18-19H2
charge 0 multiplicity 1
41 atoms
N  -0.001044 -0.208017 -0.000092
N  0.747085 -2.230259 -0.959803
N  -0.766803 -2.227311 0.95201
N  -0.019406 -4.349271 -0.008188
N  1.421559 -4.285271 -1.850016
N  -1.459726 -4.279766 1.833941
C  0.71606 0.557818 -1.041833
C  -0.712391 0.560194 1.043959
C  1.923165 1.321406 -0.501831
C  -1.91316 1.335058 0.505936
C  -0.006956 -1.588171 -0.002596
C  2.036486 2.721499 -0.682655
C  -2.01217 2.736446 0.685154
C  2.962519 0.63054 0.174065
C  -2.960721 0.653737 -0.167023
C  3.169529 3.421811 -0.205838
C  -3.139032 3.447465 0.209541
C  4.092616 1.326855 0.654122
C  -4.084705 1.360719 -0.645838
C  4.200875 2.726018 0.464537
C  -4.178565 2.761155 -0.457941
C  0.692237 -3.598027 -0.910884
C  -0.724244 -3.59531 0.897572
H  0.003296 1.26356 -1.509892
H  1.034881 -0.175058 -1.802022
H  -1.037149 -0.172569 1.801709
H  0.005916 1.258706 1.514409
H  1.235082 3.26469 -1.199985
H  -1.204383 3.272282 1.200215
H  2.878069 -0.453411 0.315602
H  -2.887466 -0.431202 -0.307236
H  3.245023 4.505235 -0.353714
H  -3.203419 4.531774 0.35616
H  4.890544 0.782337 1.172115
H  -4.889067 0.823529 -1.161531
H  5.07885 3.266228 0.836584
H  -5.051823 3.309613 -0.829027
H  1.40453 -5.30127 -1.839618
H  1.961365 -3.765192 -2.536094
H  -1.994747 -3.75764 2.522208
H  -1.451712 -5.295827 1.819517
