program: Gaussian 09
title: 000248833
version: EM64L-G09RevD.01
frameworkgroup: C1[X(C12H15N3O6)]
method: RPBEPBE
basis: SDD
operation: Freq
keyword: #p
keyword: freq=noraman
keyword: PBEPBE/SDD
title: #p freq=noraman PBEPBE/SDD
converged: YES YES NO NO
title: Mulliken charges:
elementType: O O O O O O N N N C C C C C C C C C C C C H H H H H H H H H H H H H H H
charge: -0.337337 -0.322122 -0.263739 -0.248899 -0.209605 -0.208132 -0.138951 -0.135099 0.019006 0.381812 0.303047 -0.526112 0.434319 -0.318962 -0.375914 0.288348 0.271132 -0.611333 -0.606612 -0.612495 -0.606494 0.305690 0.262357 0.289730 0.234902 0.274785 0.225558 0.291285 0.237441 0.215822 0.234411 0.275524 0.227623 0.296076 0.237625 0.215315
chargesum: 0.00000
title: Mulliken charges with hydrogens summed into heavy atoms:
elementType: O O O O O O N N N C C C C C C C C C C C C
charge: -0.337337 -0.322122 -0.263739 -0.248899 -0.209605 -0.208132 -0.138951 -0.135099 0.019006 0.381812 0.303047 -0.220421 0.434319 -0.056605 -0.086184 0.288348 0.271132 0.123911 0.137935 0.125063 0.142522
polarizability: 2.70325300e+02 -1.50312460e+00 1.68004335e+02 1.15605942e+00 1.95700963e+01 1.19561544e+02
1716.lowfreq: -7.7479 -4.2138 -0.0005 -0.0003 0.0006 6.7458 12.5121 27.5975 31.2797
frequency: 12.3090 27.5933 31.2172 42.7706 51.0093 64.0620 80.4854 96.4944 100.9514 119.1575 131.7432 133.5968 136.6851 141.3663 178.5097 204.3356 220.9270 231.1909 238.0281 251.5360 298.2028 316.7291 341.2396 347.7424 389.9998 405.8693 454.0491 465.3491 475.9710 523.6857 542.4607 582.7002 592.7721 625.1035 648.9215 671.5866 680.7478 692.2661 714.6156 752.5640 764.4503 771.8656 807.0738 849.7149 908.6258 931.8135 964.2530 980.0389 981.0691 1062.1087 1063.3432 1065.9333 1088.9548 1097.2246 1098.8170 1114.1051 1121.1455 1144.6674 1145.4749 1169.5006 1214.0279 1235.1296 1245.3010 1248.6256 1256.6888 1358.2639 1364.8563 1369.4080 1400.0931 1423.7865 1424.4295 1425.9596 1441.4301 1445.9691 1467.9407 1469.4175 1475.7518 1477.5470 1479.5803 1484.8520 1486.1453 1496.5549 1500.8906 1588.8952 1611.7460 1681.5113 1698.2596 2972.5866 2974.1284 2979.1197 2981.1017 3049.5995 3051.5364 3060.2133 3064.3204 3123.3208 3123.6566 3129.9724 3137.2731 3171.7706 3192.1986 3195.1092
redmass: 4.7167 4.4352 4.5793 5.1173 8.8529 3.3823 2.0841 1.8804 1.6562 2.1546 1.1444 4.5074 3.7987 1.1904 5.5520 4.4374 4.2526 3.4014 3.3835 5.4485 7.8277 5.2609 4.2583 4.8114 3.4887 3.4138 3.7895 4.3008 5.9784 6.1333 5.6151 6.4639 5.7755 7.0922 9.1704 10.1806 11.1149 6.4957 5.0114 10.6635 6.5785 5.4839 5.5108 1.6136 5.3158 1.5009 4.3217 3.6819 1.3565 1.4829 1.4615 1.9714 2.3391 1.2250 1.2254 1.7519 2.3392 1.3791 1.3794 2.1996 5.6745 4.6702 1.8459 4.0059 4.0858 4.0962 4.2946 4.3790 10.7336 1.6143 2.0303 1.1700 1.1805 1.1708 1.0502 1.0492 1.4670 1.6123 1.0565 1.0559 1.0516 1.1486 1.1778 8.7475 7.6820 8.9110 9.3917 1.0364 1.0361 1.0387 1.0382 1.1019 1.1020 1.0991 1.0991 1.0981 1.0979 1.0995 1.0983 1.0898 1.0930 1.0964
irintensity: 0.4576 3.6847 2.6098 2.4954 0.4409 0.0783 1.0712 1.7723 0.8656 0.1318 0.2649 2.9456 6.6033 0.4240 0.5821 0.7077 4.7350 1.6273 6.5230 0.9707 3.3925 11.3366 26.4891 4.9913 0.4909 4.8146 1.1293 2.7471 9.0778 0.3980 0.9255 4.4157 7.1230 0.2866 9.8718 19.8091 27.9902 13.8354 20.0050 30.1500 12.2920 15.3321 50.5034 33.2865 13.6601 28.7847 107.8718 64.1575 0.2237 31.1878 24.6048 105.7857 244.6945 0.9943 1.2948 17.2250 936.8357 3.7477 3.3466 27.5346 221.5009 442.3746 13.9271 11.8682 105.4670 29.8247 107.0436 200.3293 13.1721 67.7435 31.1702 16.4902 12.0453 3.6245 12.6080 48.7113 87.5485 62.1391 5.9677 33.2337 15.2751 5.3634 41.4996 22.2740 27.8307 271.1609 455.0874 35.3756 35.5890 97.5006 95.4975 47.5011 28.8052 24.2502 25.0149 1.7022 2.8718 4.3281 3.8677 1.5117 4.5276 5.5818
temp: 298.150 k
press: 1.00000 atm
elementType: 8 8 8 8 8 8 7 7 7 6 6 6 6 6 6 6 6 6 6 6 6 1 1 1 1 1 1 1 1 1 1 1 1 1 1 1
symmnumber: 1
zpe: 706548.5 jmol-1
zpe.correction: 0.269110 hartree
zpe.thermalcorrener: 0.291420 hartree
zpe.thermalcorrenthalpy: 0.292365 hartree
zpe.thermalcorrgfe: 0.214268 hartree
zpe.sumelectzpe: -1080.223250 hartree
zpe.sumelectthermal: -1080.200940 hartree
zpe.sumelectthermalent: -1080.199996 hartree
zpe.sumelectthermalfe: -1080.278092 hartree
dipole: -9.5370 -0.4557 -0.5018
dipole: 9.5610
quadrupole: -128.2042 -107.2053 -129.6889
quadrupole: -9.1693 -1.9854 6.1139
quadrupole: -6.5047 14.4942 -7.9894 -9.1693 -1.9854 6.1139
hfenergy: -1080.4923605 hartree
pointgroup: C01 [X(C12H15N3O6)]
dipole: -3.7488102 -0.2317981 0.2056146 debye
polarizability: 268.9215115|12.460252|161.8390136|-2.8298436|26.1722716|127.1306538 unknown
InChI: InChI=1S/C12H15N3O6/c1-13(2)11(16)20-9-6-5-8(15(18)19)7-10(9)21-12(17)14(3)4/h5-7H,1-4H3
charge 0 multiplicity 1
36 atoms
O  -0.181971 -1.113957 -0.617829
O  -0.938269 1.41444 0.682757
O  -1.003128 -1.517187 1.571388
O  -1.5849 1.42424 -1.601446
O  5.406086 0.992569 0.212071
O  4.813829 -0.997855 -0.733445
N  -2.028024 -2.451493 -0.335418
N  -3.171489 1.365602 0.143551
N  4.524146 0.130405 -0.173921
C  0.766827 -0.17735 -0.15821
C  0.394438 1.069836 0.417185
C  2.121524 -0.482101 -0.357736
C  3.096638 0.455888 0.039589
C  1.39107 1.983447 0.822847
C  2.752319 1.686891 0.640531
C  -1.09766 -1.694668 0.332631
C  -1.908963 1.385764 -0.392346
C  -2.964937 -3.269425 0.453062
C  -2.076466 -2.582176 -1.80401
C  -4.320442 1.54951 -0.759442
C  -3.443459 1.254698 1.590244
H  2.415729 -1.43342 -0.806625
H  1.071402 2.928291 1.270727
H  3.539455 2.382821 0.939022
H  -2.818353 -4.344198 0.233842
H  -2.782728 -3.093066 1.5236
H  -4.010283 -2.999852 0.211372
H  -1.623806 -1.699904 -2.276399
H  -1.538242 -3.487737 -2.145162
H  -3.132116 -2.660152 -2.120415
H  -4.898255 2.447446 -0.469546
H  -3.952771 1.674348 -1.788895
H  -4.990344 0.670078 -0.717741
H  -2.637225 0.69411 2.084061
H  -3.531472 2.251995 2.062549
H  -4.395758 0.712862 1.729761
