program: Gaussian 09
title: 000248848
version: EM64L-G09RevD.01
frameworkgroup: C1[X(C20H22Cl2N2O2)]
method: RPBEPBE
basis: SDD
operation: Freq
keyword: #p
keyword: freq=noraman
keyword: PBEPBE/SDD
title: #p freq=noraman PBEPBE/SDD
converged: YES YES NO NO
title: Mulliken charges:
elementType: Cl Cl O O N N C C C C C C C C C C C C C C C C C C C C H H H H H H H H H H H H H H H H H H H H H H
charge: -0.056169 -0.054367 -0.269253 -0.307494 -0.130870 -0.405633 -0.154419 -0.645320 0.218460 0.566957 -0.376844 -0.328611 0.187585 -0.604366 -0.582777 -0.453349 -0.377229 0.261314 -0.223028 -0.233429 -0.239652 -0.348555 -0.362705 -0.223423 -0.231755 -0.224375 0.271445 0.248483 0.222406 0.323252 0.245220 0.249019 0.237027 0.279172 0.354695 0.259576 0.304081 0.258151 0.231914 0.223985 0.227254 0.229324 0.231265 0.270866 0.234659 0.233406 0.230683 0.233421
chargesum: 0.00000
title: Mulliken charges with hydrogens summed into heavy atoms:
elementType: Cl Cl O O N N C C C C C C C C C C C C C C C C C C C C
charge: -0.056169 -0.054367 -0.269253 -0.307494 -0.130870 -0.082380 0.117026 -0.174431 0.218460 0.566957 0.117395 0.187589 0.187585 0.009906 -0.020546 -0.221435 -0.153244 0.261314 0.004226 -0.004105 -0.008386 -0.077690 -0.128046 0.009984 -0.001072 0.009046
polarizability: 2.97585172e+02 6.49577400e-01 2.19516981e+02 1.94876968e+01 3.90065131e+00 2.36247212e+02
1716.lowfreq: -7.2267 -2.9394 0.0020 0.0024 0.0031 4.5770 14.2396 14.7126 19.8429
frequency: 13.9010 14.6253 19.6520 21.3860 23.3940 31.0057 41.8500 55.2974 64.5590 79.4851 82.8231 93.7371 103.9818 145.1304 147.3079 165.2839 170.0500 207.0384 220.7191 233.2633 247.0059 283.7216 298.1801 338.2666 345.3080 367.1931 401.3221 402.3022 406.2289 409.8821 447.7506 488.9721 498.0958 546.1666 558.9004 569.9312 614.0374 617.3871 631.2644 660.9100 684.4954 693.3520 697.3152 703.4116 704.8434 717.7192 753.2733 783.0481 792.6790 796.9829 800.6909 834.5741 851.5606 857.1269 868.0794 881.7530 923.9393 939.0368 954.5263 974.6989 984.6850 990.2878 990.5731 996.0891 1001.5125 1005.0006 1017.0036 1023.4053 1027.4952 1041.0641 1044.6789 1055.9448 1071.0851 1084.4354 1090.9670 1119.7197 1140.5386 1154.0126 1173.4581 1173.9659 1188.0762 1189.8228 1201.4410 1216.4620 1227.7885 1255.3298 1264.7658 1273.1143 1275.7734 1288.6271 1300.6691 1308.2478 1318.0993 1334.7854 1340.0174 1354.1794 1363.1396 1383.1690 1385.4667 1407.5065 1433.0164 1440.8783 1450.3752 1459.9140 1462.2559 1476.0063 1480.8500 1484.7054 1491.1214 1501.3596 1563.7997 1581.9023 1595.2235 1599.3826 1611.6032 1614.9956 2980.2125 3022.2904 3032.9843 3041.1023 3041.7052 3062.0176 3077.6206 3087.3625 3101.6616 3111.3376 3113.9618 3124.7540 3133.1216 3133.8343 3134.4694 3145.9736 3146.4650 3153.9755 3158.8581 3164.5635 3170.3876 3550.8811
redmass: 4.7701 7.6134 4.1709 6.3255 7.0977 8.2601 12.9256 6.7337 5.0599 5.5475 5.1115 2.8733 4.7923 3.3382 4.5058 4.9052 5.0660 4.7582 4.4330 6.3692 4.7146 5.4752 4.8488 2.4761 3.8817 4.5787 3.0713 2.8007 3.7400 3.6915 3.6599 4.5376 3.6374 5.2501 1.4504 3.1838 6.2473 6.3530 5.4646 6.6955 5.4438 4.5651 5.4414 1.8887 1.7006 4.5419 1.7853 1.1927 2.3958 2.7086 1.4395 4.6508 1.2617 1.2631 2.2406 2.8167 1.5866 1.4561 2.9864 1.3950 1.4792 6.0380 4.8030 1.3199 1.5129 1.3439 2.1893 2.4591 2.1162 2.5125 2.4131 3.6501 3.1130 1.6349 1.6566 1.4636 2.1359 1.4819 1.0557 1.0591 1.1280 1.1201 1.6836 2.3955 2.3338 1.3318 1.1857 1.2792 1.7033 1.3166 1.2644 1.4510 1.3302 1.2804 1.4751 1.2620 1.2740 7.5582 9.1396 2.4800 2.2173 2.1242 1.1069 1.1358 1.4704 1.4155 1.1083 2.2955 1.7200 1.2604 6.2941 6.1371 6.0605 6.5590 6.0167 6.1974 1.0616 1.0620 1.0602 1.0935 1.0629 1.0574 1.0978 1.0901 1.1047 1.0886 1.0874 1.0863 1.0896 1.0882 1.1122 1.0953 1.0925 1.1116 1.0959 1.1013 1.1009 1.0773
irintensity: 1.4054 0.2766 0.0405 0.0466 0.1120 0.8192 0.2309 5.8610 0.3532 1.0098 5.5349 3.0471 2.1490 1.5288 2.9396 5.6423 6.4810 6.6085 0.5254 2.4117 2.2696 12.5095 7.0327 11.6128 6.3500 21.7281 3.5478 0.1899 3.8704 7.1543 3.4587 21.3427 21.3364 15.1124 122.0841 10.6177 0.9551 0.5032 50.5498 7.5336 28.1382 13.5520 23.5138 54.0504 42.2774 80.5109 48.2157 10.1205 24.3453 0.3498 14.4986 5.4170 0.5824 1.8451 10.4012 4.3730 6.7871 3.1655 2.2524 0.2035 1.4171 0.2984 0.8360 0.2155 4.6710 1.3287 6.0514 4.6503 10.0298 3.4776 5.6070 5.0197 2.9027 16.8983 13.6593 31.1586 12.7068 53.6922 0.1004 1.0592 2.8366 7.8146 19.1497 0.9984 23.4743 24.8593 11.6139 12.5435 75.8797 17.8313 13.3711 9.3630 2.3608 1.5024 46.7351 14.8403 12.2369 1.1268 1.4500 163.1767 1.4317 4.3797 17.5990 10.2776 171.7664 10.3020 16.8344 17.7826 49.3253 103.9732 157.7015 222.0202 1.7563 32.7244 9.3918 6.2345 27.0625 22.9808 12.0473 3.3199 40.1945 17.4743 21.7330 11.6638 1.8825 11.4485 11.1318 4.6222 6.7434 1.2006 21.4482 32.0607 22.0771 6.5681 16.7692 22.2011 21.0354 21.0025
temp: 298.150 k
press: 1.00000 atm
elementType: 17 17 8 8 7 7 6 6 6 6 6 6 6 6 6 6 6 6 6 6 6 6 6 6 6 6 1 1 1 1 1 1 1 1 1 1 1 1 1 1 1 1 1 1 1 1 1 1
symmnumber: 1
zpe: 1000555.1 jmol-1
zpe.correction: 0.381091 hartree
zpe.thermalcorrener: 0.406935 hartree
zpe.thermalcorrenthalpy: 0.407879 hartree
zpe.thermalcorrgfe: 0.318003 hartree
zpe.sumelectzpe: -1953.527858 hartree
zpe.sumelectthermal: -1953.502015 hartree
zpe.sumelectthermalent: -1953.501071 hartree
zpe.sumelectthermalfe: -1953.590947 hartree
dipole: -3.1776 1.4300 -1.4291
dipole: 3.7662
quadrupole: -162.8114 -157.5120 -183.1675
quadrupole: 7.8756 14.1619 -2.6230
quadrupole: 5.0189 10.3183 -15.3372 7.8756 14.1619 -2.6230
hfenergy: -1953.9089496 hartree
pointgroup: C01 [X(C20H22Cl2N2O2)]
dipole: 0.9878201 0.9273637 0.599797 debye
polarizability: 289.7065491|24.863475|229.6400505|18.5331007|1.2512739|234.002765 unknown
InChI: InChI=1S/C20H22Cl2N2O2/c21-11-13-24(14-12-22)20(26)18(15-16-7-3-1-4-8-16)23-19(25)17-9-5-2-6-10-17/h1-10,18,23H,11-15H2
charge 0 multiplicity 1
48 atoms
Cl -3.139701 -0.548441 -4.015639
Cl -5.740347 -3.48278 2.018408
O  -1.479428 -1.44619 1.948923
O  0.683896 -0.768956 -1.796754
N  -2.812372 -1.300409 0.050617
N  0.565984 -0.149594 0.440868
C  -0.836374 0.271085 0.345342
C  -1.113059 1.522374 1.232523
C  -1.737063 -0.893553 0.831697
C  -0.240387 2.716384 0.873787
C  -3.211086 -0.682689 -1.237488
C  -3.606375 -2.461218 0.530452
C  1.250997 -0.639238 -0.660242
C  -2.473927 -1.327051 -2.426211
C  -4.685318 -1.998602 1.521878
C  0.733177 3.201512 1.782446
C  -0.382714 3.367402 -0.378802
C  2.689973 -1.012714 -0.44162
C  1.549037 4.307427 1.448962
C  0.429957 4.470839 -0.717199
C  1.400843 4.944601 0.196364
C  3.276946 -1.937686 -1.342146
C  3.477319 -0.45716 0.601077
C  4.623826 -2.324462 -1.186903
C  4.82706 -0.842484 0.752386
C  5.400937 -1.782035 -0.135687
H  -1.005113 0.510256 -0.715492
H  -0.968128 1.235002 2.291124
H  -2.185199 1.780496 1.118707
H  0.948617 -0.280605 1.379233
H  -3.027828 0.404541 -1.225507
H  -4.300948 -0.815104 -1.361496
H  -4.071562 -2.959555 -0.337472
H  -2.931242 -3.172593 1.033475
H  -1.389963 -1.133277 -2.411721
H  -2.683928 -2.403948 -2.511237
H  -4.240261 -1.615122 2.450179
H  -5.384969 -1.271636 1.081924
H  0.8462 2.717591 2.761034
H  -1.13342 3.012345 -1.096866
H  2.294547 4.671874 2.16477
H  0.307409 4.960819 -1.689492
H  2.031882 5.801189 -0.065132
H  2.660492 -2.332331 -2.15632
H  3.058756 0.308187 1.265447
H  5.069007 -3.044272 -1.882242
H  5.433076 -0.403215 1.552204
H  6.448275 -2.0806 -0.015759
