program: Gaussian 09
title: 000248886
version: EM64L-G09RevD.01
frameworkgroup: C1[X(C24H27O4P)]
method: RPBEPBE
basis: SDD
operation: Freq
keyword: #p
keyword: freq=noraman
keyword: PBEPBE/SDD
title: #p freq=noraman PBEPBE/SDD
converged: YES YES NO NO
title: Mulliken charges:
elementType: P O O O O C C C C C C C C C C C C C C C C C C C C C C C C H H H H H H H H H H H H H H H H H H H H H H H H H H H
charge: 1.308639 -0.525609 -0.523607 -0.523707 -0.588964 0.369350 0.369584 0.366698 0.376106 0.374407 0.377558 0.326187 0.326472 0.326579 -0.533665 -0.532238 -0.575191 -0.395132 -0.394458 -0.352916 -0.390104 -0.389957 -0.393033 -0.810135 -0.810100 -0.807409 -0.808340 -0.808326 -0.809121 0.287868 0.286398 0.262667 0.257733 0.257755 0.286567 0.234050 0.234050 0.232514 0.238085 0.226623 0.225099 0.225817 0.226051 0.238018 0.227126 0.233589 0.226260 0.226268 0.228924 0.226024 0.226833 0.229012 0.225634 0.225054 0.230184 0.226229
chargesum: 0.00000
title: Mulliken charges with hydrogens summed into heavy atoms:
elementType: P O O O O C C C C C C C C C C C C C C C C C C C C C C C C
charge: 1.308639 -0.525609 -0.523607 -0.523707 -0.588964 0.369350 0.369584 0.366698 0.376106 0.374407 0.377558 0.326187 0.326472 0.326579 -0.245797 -0.245840 -0.312524 -0.137399 -0.136703 -0.066349 -0.156054 -0.155907 -0.160518 -0.120327 -0.120215 -0.120434 -0.127124 -0.126848 -0.127655
polarizability: 3.28960032e+02 2.95205553e-01 3.16388471e+02 -7.95494348e+00 1.41788598e+00 2.85909639e+02
1716.lowfreq: -8.4039 -1.6629 -0.0013 -0.0004 0.0005 2.3050 4.6865 8.6523 9.8508
frequency: -6.5314 8.2469 9.3882 13.1350 17.4195 28.9809 59.6320 85.1997 92.6192 101.4042 104.4449 107.2223 116.1298 119.0536 134.6620 148.9741 158.2486 161.0906 185.1476 187.1979 198.0482 215.9154 218.2674 239.7875 242.2242 250.7489 266.4864 291.1345 291.7300 293.0117 337.8774 338.7474 345.5433 380.8670 381.6670 426.0411 441.8743 444.9868 445.6664 447.3227 454.7333 481.5403 486.7887 512.9292 531.1346 543.7237 545.0052 568.3918 576.1170 577.7988 607.3061 646.5921 656.0555 713.4442 714.2330 714.5422 734.4624 738.9263 739.5856 759.5849 793.1816 797.1261 821.8912 823.0387 826.8493 888.2441 890.5648 893.0061 924.0561 925.2439 933.5873 948.7624 949.4807 954.5021 991.3071 991.6458 992.0833 999.7187 1000.1638 1003.1160 1029.6269 1029.7361 1030.8639 1034.4282 1052.1965 1052.8768 1054.1080 1114.2190 1114.7863 1118.0213 1146.1690 1147.5636 1155.4483 1187.3528 1189.2503 1194.7414 1248.2452 1250.2826 1252.4674 1274.5863 1281.6332 1283.4888 1370.3438 1370.5177 1371.0164 1391.6452 1393.1296 1393.9643 1400.9597 1402.0265 1403.9650 1407.0642 1407.6132 1412.1471 1461.1742 1463.1768 1463.5632 1470.1344 1470.2929 1470.7918 1473.9304 1475.5441 1476.2956 1476.7269 1476.9309 1477.6179 1488.6880 1490.7959 1493.2824 1583.8875 1592.9410 1593.1501 1612.0121 1613.7354 1620.8524 2967.8130 2968.8795 2969.0348 2971.1027 2971.2932 2971.4236 3039.1385 3039.7624 3039.8253 3043.7067 3043.9757 3044.6285 3083.1938 3083.5502 3083.7768 3088.3639 3090.3176 3090.4723 3129.1361 3129.7206 3129.9590 3150.3300 3151.6003 3157.9333 3168.6646 3176.2114 3176.2560
redmass: 3.8054 4.4340 4.3501 3.7845 4.0249 4.7745 4.9433 5.8680 4.8326 2.3892 2.7850 1.2854 1.2281 1.1523 2.3995 1.1480 1.1166 1.1447 3.3811 3.5556 3.1445 4.6634 4.6934 5.3452 4.5566 5.2001 5.0260 2.5278 2.5566 2.5387 4.4737 4.5177 4.6266 5.1861 5.3564 4.1360 3.6860 3.1169 2.8836 3.0015 4.4167 6.0176 5.6512 4.4484 5.2179 4.5261 4.5324 4.0200 3.6308 3.6963 6.4294 7.3231 7.2785 2.8745 2.8673 2.8791 5.1633 4.6233 4.4766 5.5836 7.8076 8.2266 1.3391 1.3379 1.3126 1.4074 1.3857 1.3757 4.0340 3.8913 3.3568 1.3518 1.3483 1.3383 1.6103 1.6145 1.6185 1.4824 1.4824 1.5183 1.5624 1.5329 1.4707 5.8980 1.6418 1.6451 1.6404 1.6768 1.6815 1.9560 1.6909 1.7382 1.7015 2.8003 2.7642 2.1640 3.5176 3.4094 3.5809 1.3443 1.3000 1.3174 6.3746 6.3615 6.3380 1.2366 1.2348 1.2355 2.3992 2.2454 1.3266 1.4349 1.4517 2.4036 1.0471 1.0475 1.0473 1.1797 1.1813 1.2282 1.0497 1.0799 1.1998 1.1207 1.1865 1.1912 2.0792 2.0452 2.2102 6.8298 7.3553 7.3583 6.3207 6.2837 6.6584 1.0377 1.0376 1.0376 1.0385 1.0384 1.0382 1.0970 1.0970 1.0969 1.0968 1.0969 1.0969 1.0981 1.0982 1.0982 1.0979 1.0979 1.0979 1.0899 1.0898 1.0898 1.0926 1.0926 1.0923 1.0958 1.0955 1.0955
irintensity: 0.2152 0.4048 0.3452 0.2450 0.1997 1.0257 0.0331 2.6969 0.8859 1.2891 2.0154 0.5689 0.3211 0.6810 0.2160 1.2385 0.8258 1.4933 0.4980 0.2841 0.3051 8.1209 11.1098 1.6456 3.6098 8.3267 1.4956 0.1717 0.2413 0.3980 4.3997 3.7762 1.6228 22.8907 26.4272 18.9510 17.9709 15.9038 6.1045 13.0638 23.2754 11.8168 16.8181 14.2433 10.2276 4.5744 8.1539 5.5250 19.0504 9.4611 8.2842 88.3939 71.1835 0.8497 0.7898 1.2623 22.2879 2.8499 3.5242 1.4908 333.1458 316.3964 29.6042 58.8910 56.6543 19.6091 14.0051 32.7274 245.8229 239.6250 0.5581 2.5035 4.3333 7.1558 22.3951 13.3007 5.8405 107.6774 100.7098 11.6367 6.0227 28.7311 26.4815 50.1097 0.0980 0.0739 0.0956 20.5781 27.3400 44.1172 158.9591 156.4223 2.8600 49.0822 24.0596 9.9359 53.7222 43.6488 4.1146 8.9275 13.1583 4.8257 3.4732 5.6574 0.1654 6.4381 5.0702 5.7694 10.6233 7.5752 12.2464 33.9713 27.8460 14.5493 0.2595 0.1070 0.2178 24.5015 33.1888 26.0858 27.3286 21.9891 18.5716 22.0280 24.6880 18.5933 188.8158 164.6210 18.5380 31.1936 13.6995 12.4172 48.2700 38.3433 28.5451 61.5697 76.0745 40.7362 13.6425 26.1141 21.1778 34.1351 27.4381 55.8123 3.2314 1.6046 6.8932 26.7889 25.6724 30.0952 12.3538 14.1235 12.6945 22.6152 21.4553 18.0523 0.0156 0.0623 2.5830 0.3132 0.4726 6.5907
temp: 298.150 k
press: 1.00000 atm
elementType: 15 8 8 8 8 6 6 6 6 6 6 6 6 6 6 6 6 6 6 6 6 6 6 6 6 6 6 6 6 1 1 1 1 1 1 1 1 1 1 1 1 1 1 1 1 1 1 1 1 1 1 1 1 1 1 1
symmnumber: 1
zpe: 1170298.8 jmol-1
zpe.correction: 0.445743 hartree
zpe.thermalcorrener: 0.475679 hartree
zpe.thermalcorrenthalpy: 0.476623 hartree
zpe.thermalcorrgfe: 0.380629 hartree
zpe.sumelectzpe: -1570.775796 hartree
zpe.sumelectthermal: -1570.745860 hartree
zpe.sumelectthermalent: -1570.744916 hartree
zpe.sumelectthermalfe: -1570.840910 hartree
dipole: 0.0606 0.0458 0.3487
dipole: 0.3569
quadrupole: -152.8885 -156.4827 -168.3279
quadrupole: 0.0129 -2.8316 0.2611
quadrupole: 6.3445 2.7504 -9.0949 0.0129 -2.8316 0.2611
hfenergy: -1571.2215391 hartree
pointgroup: C01 [X(C24H27O4P1)]
dipole: -0.0327678 0.0047603 -0.1364506 debye
polarizability: 326.3144505|4.7142337|318.6426746|-7.4916274|-5.108933|286.3010175 unknown
InChI: InChI=1S/C24H27O4P/c1-16-7-10-22(13-19(16)4)26-29(25,27-23-11-8-17(2)20(5)14-23)28-24-12-9-18(3)21(6)15-24/h7-15H,1-6H3
charge 0 multiplicity 1
56 atoms
P  -0.044437 0.065134 0.056083
O  0.4703 1.417643 0.989563
O  0.836413 -1.195954 0.831574
O  -1.610409 -0.193447 0.722996
O  0.07083 0.17474 -1.525981
C  -0.299007 4.657199 -0.791726
C  4.137028 -1.806701 -0.896705
C  -4.258552 -2.802892 0.81062
C  0.060408 2.766051 0.714972
C  2.231747 -1.435429 0.589345
C  -2.52805 -1.177037 0.2197
C  -0.618507 5.479109 0.333036
C  4.958861 -2.074525 0.241588
C  -4.48627 -3.04641 -0.579999
C  0.048366 3.299206 -0.590726
C  2.768283 -1.493457 -0.713679
C  -3.269967 -1.868118 1.196893
C  -0.255479 3.551956 1.836844
C  3.020129 -1.689663 1.724982
C  -2.736442 -1.391692 -1.156281
C  -0.585718 4.908628 1.629411
C  4.380448 -2.01485 1.533465
C  -3.717344 -2.336318 -1.533367
C  -0.321917 5.226411 -2.198991
C  4.713775 -1.862853 -2.299949
C  -5.05804 -3.539356 1.870357
C  -0.986863 6.940459 0.14905
C  6.428859 -2.416749 0.076513
C  -5.533599 -4.048767 -1.031121
H  0.302237 2.660948 -1.443682
H  2.127145 -1.2908 -1.578044
H  -3.067419 -1.667039 2.253446
H  -0.238235 3.105057 2.834595
H  2.57171 -1.63341 2.72062
H  -2.153275 -0.846515 -1.904392
H  -0.830572 5.534961 2.495176
H  5.007054 -2.219695 2.409339
H  -3.890732 -2.519352 -2.600297
H  -0.045791 4.463203 -2.945305
H  -1.326291 5.610462 -2.46296
H  0.380094 6.075979 -2.304537
H  5.554632 -1.152914 -2.420264
H  5.112123 -2.868985 -2.534569
H  3.951484 -1.61566 -3.057301
H  -4.922426 -4.63527 1.791594
H  -4.756008 -3.234056 2.886096
H  -6.143083 -3.345609 1.766483
H  -1.878449 7.05907 -0.496643
H  -1.206667 7.420764 1.117569
H  -0.168846 7.510637 -0.332427
H  6.985484 -1.597746 -0.418943
H  6.906187 -2.604462 1.053199
H  6.570958 -3.319579 -0.54839
H  -6.542493 -3.77964 -0.662656
H  -5.581661 -4.107294 -2.131705
H  -5.317206 -5.065076 -0.648465
