program: Gaussian 09
title: 000248847
version: EM64L-G09RevD.01
frameworkgroup: C1[X(C15H20Cl2N2O2)]
method: RPBEPBE
basis: SDD
operation: Freq
keyword: #p
keyword: freq=noraman
keyword: PBEPBE/SDD
title: #p freq=noraman PBEPBE/SDD
converged: YES YES NO NO
title: Mulliken charges:
elementType: Cl Cl O O N N C C C C C C C C C C C C C C C H H H H H H H H H H H H H H H H H H H H
charge: -0.056465 -0.054589 -0.269916 -0.299593 -0.130945 -0.381720 -0.155211 -0.651512 0.225363 -0.377246 -0.328484 0.560080 -0.603378 -0.582873 -0.444742 -0.379308 0.273028 -0.223957 -0.233153 -0.239947 -0.770084 0.273701 0.224964 0.249647 0.249298 0.244020 0.237219 0.278140 0.317089 0.355827 0.259380 0.304725 0.258148 0.231058 0.224436 0.227540 0.229294 0.231405 0.216671 0.253939 0.258153
chargesum: 0.00000
title: Mulliken charges with hydrogens summed into heavy atoms:
elementType: Cl Cl O O N N C C C C C C C C C C C C C C C
charge: -0.056465 -0.054589 -0.269916 -0.299593 -0.130945 -0.064631 0.118490 -0.176902 0.225363 0.116073 0.186875 0.560080 0.011829 -0.020000 -0.213683 -0.154872 0.273028 0.003583 -0.003859 -0.008543 -0.041322
polarizability: 2.44516721e+02 -2.10391122e+00 1.93724480e+02 -2.78667448e+00 -2.42427782e+01 1.55074524e+02
1716.lowfreq: -8.5547 -1.7703 -0.0019 -0.0012 0.0011 6.4805 12.4054 21.6711 23.7113
frequency: 12.3184 21.3583 23.6707 26.5462 34.9795 45.8991 55.3820 69.4805 75.9689 81.2209 92.0243 102.7735 147.2854 150.2474 158.8221 207.3093 219.7920 222.6663 243.1204 276.4584 296.9327 336.6754 346.1785 389.7945 403.2816 412.6675 452.0862 490.7737 528.7848 534.6642 562.8297 596.3133 605.6859 617.4006 631.8711 690.7594 697.8734 703.1083 717.4061 755.4496 780.6797 796.4853 800.3434 850.1494 861.7077 864.4813 919.0138 939.5388 955.6935 974.2791 990.3026 993.6139 996.3107 1001.3212 1021.4697 1027.5937 1039.9506 1044.0081 1046.0842 1055.3242 1089.5604 1111.5166 1119.6535 1152.6246 1173.2903 1187.5965 1197.7188 1216.5304 1225.6991 1253.3694 1262.0861 1272.2172 1274.1366 1290.5147 1299.9180 1309.5900 1333.6511 1338.8032 1354.5405 1361.7985 1383.2319 1390.1167 1406.8050 1440.5859 1448.9666 1450.0916 1457.9788 1461.6802 1470.3218 1480.5389 1483.7275 1487.3321 1499.7834 1581.8887 1594.9756 1602.8351 1615.0741 2982.0519 3000.4214 3021.2546 3032.5323 3041.1984 3041.9953 3061.5062 3075.6145 3085.8419 3100.1441 3101.0846 3106.2574 3111.3651 3114.9020 3133.3654 3134.3253 3146.2705 3153.7495 3164.7174 3558.7311
redmass: 7.3841 4.1916 7.2352 6.3255 9.0705 4.1818 6.8009 3.4957 1.2531 4.3722 3.1395 3.5445 2.7273 4.9282 5.1732 5.7865 4.6509 5.2184 4.3149 5.2806 3.5564 2.7796 2.9341 3.4376 2.7908 3.4587 3.1812 3.6211 1.6063 3.9628 3.7421 2.8782 4.5373 6.3587 5.6675 5.6574 5.9302 1.8681 4.8411 1.7863 1.1908 1.7902 2.0215 1.2732 2.1717 2.6395 1.8026 3.5285 3.1061 1.3955 6.1991 1.5140 1.3526 1.5165 2.1622 2.0701 3.0191 1.7845 1.8744 3.4806 1.7496 2.7162 1.4902 1.4324 1.0557 1.1298 1.5259 2.4338 2.3379 1.3340 1.2211 1.7092 1.2595 1.2690 1.2430 1.4286 1.2731 1.4175 1.2492 1.2746 7.5278 1.2281 2.4502 2.1278 1.1061 1.0466 1.1077 1.2323 1.1482 1.1293 1.9844 1.5399 1.2035 6.3127 6.0540 5.9268 6.1921 1.0614 1.0359 1.0617 1.0601 1.0684 1.0880 1.0574 1.0983 1.0899 1.0983 1.1048 1.1007 1.0887 1.0875 1.0897 1.1127 1.0954 1.1115 1.1014 1.0780
irintensity: 0.0695 0.0709 0.5961 3.3167 1.9894 3.3095 0.4260 13.4217 0.3899 4.1561 4.6029 0.3061 5.0441 4.3671 7.7349 5.1738 0.5890 0.8825 2.4214 9.1353 6.0272 12.8370 7.3798 17.1035 0.0268 8.9899 7.8029 17.2515 146.5217 15.8348 6.4808 4.2208 2.7526 0.3694 43.3588 23.6087 17.4058 47.5656 52.8684 48.6977 9.2444 1.0781 14.3379 0.3086 0.5606 10.6750 0.9294 5.7191 3.2924 0.1900 0.2700 5.1058 1.1130 4.0981 2.1848 10.5810 1.2622 8.9921 6.3202 3.4019 10.9498 23.9827 29.8942 36.6014 0.0943 2.1095 17.8693 0.5021 20.2292 24.3696 14.0865 46.6771 6.4769 18.0508 13.9713 4.0140 0.2894 28.4406 8.0159 8.7540 1.0190 62.0899 132.3113 4.0326 15.5150 19.2228 11.3926 123.6693 22.5477 27.8070 21.9491 28.7850 73.0931 248.3288 3.1333 175.0207 5.9614 23.5394 8.6278 19.1604 11.9113 17.7904 22.5316 17.5987 18.5709 12.9509 8.4696 2.0071 14.9821 13.5812 10.3988 6.9382 16.1904 35.5006 6.4924 22.5445 22.7109
temp: 298.150 k
press: 1.00000 atm
elementType: 17 17 8 8 7 7 6 6 6 6 6 6 6 6 6 6 6 6 6 6 6 1 1 1 1 1 1 1 1 1 1 1 1 1 1 1 1 1 1 1 1
symmnumber: 1
zpe: 862772.4 jmol-1
zpe.correction: 0.328613 hartree
zpe.thermalcorrener: 0.351529 hartree
zpe.thermalcorrenthalpy: 0.352473 hartree
zpe.thermalcorrgfe: 0.270202 hartree
zpe.sumelectzpe: -1762.106993 hartree
zpe.sumelectthermal: -1762.084076 hartree
zpe.sumelectthermalent: -1762.083132 hartree
zpe.sumelectthermalfe: -1762.165403 hartree
dipole: -3.2804 -1.8048 -0.2925
dipole: 3.7555
quadrupole: -139.9181 -157.7387 -133.1271
quadrupole: 11.1985 -4.4876 -1.6542
quadrupole: 3.6766 -14.1441 10.4675 11.1985 -4.4876 -1.6542
hfenergy: -1762.4356052 hartree
pointgroup: C01 [X(C15H20Cl2N2O2)]
dipole: -1.2998902 -0.0139963 -0.7022555 debye
polarizability: 243.5823853|9.2122601|158.3922131|-4.6338943|25.6996289|191.3411271 unknown
InChI: InChI=1S/C15H20Cl2N2O2/c1-12(20)18-14(11-13-5-3-2-4-6-13)15(21)19(9-7-16)10-8-17/h2-6,14,18H,7-11H2,1H3
charge 0 multiplicity 1
41 atoms
Cl 1.937058 1.503705 3.957026
Cl 6.005972 0.869579 -1.951259
O  1.71453 -1.068944 -1.742981
O  -0.311637 -1.813541 2.076001
N  2.406114 0.27565 0.022385
N  -0.644068 -1.604982 -0.213046
C  -0.058252 -0.260844 -0.277654
C  -0.809143 0.636518 -1.306851
C  1.42504 -0.381765 -0.711674
C  2.154437 1.12938 1.209424
C  3.818177 0.085113 -0.399582
C  -2.288005 0.806646 -0.990654
C  2.139672 0.303661 2.509732
C  4.178238 1.067882 -1.52461
C  -3.278615 0.229154 -1.823696
C  -2.704788 1.545747 0.146625
C  -0.723514 -2.30723 0.976988
C  -4.65315 0.381066 -1.528187
C  -4.075589 1.700186 0.446534
C  -5.05573 1.116554 -0.39053
C  -1.346904 -3.693157 0.893873
H  -0.158528 0.155247 0.736347
H  -0.302689 1.622316 -1.320008
H  -0.670953 0.197687 -2.313146
H  2.953793 1.890078 1.263644
H  1.205456 1.681086 1.103872
H  4.476026 0.243363 0.472217
H  3.947172 -0.947262 -0.76373
H  -0.856101 -2.071437 -1.096501
H  1.291505 -0.39674 2.562286
H  3.094643 -0.21488 2.683579
H  3.623465 0.844971 -2.446184
H  4.055139 2.120113 -1.226085
H  -2.972772 -0.335441 -2.713666
H  -1.95469 2.007002 0.802126
H  -5.406119 -0.069733 -2.184462
H  -4.379838 2.274646 1.32855
H  -6.119922 1.236979 -0.159497
H  -1.605404 -3.996025 -0.134954
H  -0.648188 -4.430973 1.323142
H  -2.26264 -3.711174 1.509913
