program: Gaussian 09
title: 000248826
version: EM64L-G09RevD.01
frameworkgroup: C1[X(C10H11ClO3)]
method: RPBEPBE
basis: SDD
operation: Freq
keyword: #p
keyword: freq=noraman
keyword: PBEPBE/SDD
title: #p freq=noraman PBEPBE/SDD
converged: YES YES NO NO
title: Mulliken charges:
elementType: Cl O O O C C C C C C C C C C H H H H H H H H H H H
charge: -0.071071 -0.257709 -0.415316 -0.200362 0.381930 -0.505714 0.236999 -0.372491 -0.335729 -0.682142 -0.110761 -0.241758 -0.396520 0.192238 0.205861 0.225006 0.262916 0.235672 0.252537 0.212595 0.217657 0.253757 0.279213 0.246502 0.386690
chargesum: 0.00000
title: Mulliken charges with hydrogens summed into heavy atoms:
elementType: Cl O O O C C C C C C C C C C
charge: -0.071071 -0.257709 -0.028626 -0.200362 0.381930 -0.074847 0.236999 -0.109575 -0.100056 0.000647 -0.110761 0.011999 0.129195 0.192238
polarizability: 1.66301308e+02 -3.36767017e+00 1.32500036e+02 1.14777833e+01 3.47362702e-01 8.01251292e+01
1716.lowfreq: -7.7386 -0.0020 -0.0016 -0.0002 3.6321 5.0263 29.4445 35.3447 49.8550
frequency: 29.4066 35.3369 49.8513 72.7736 109.4962 133.6602 190.9315 196.7579 237.0382 264.2453 284.5352 287.2986 362.4231 374.3193 422.7590 462.5647 488.4343 502.3977 539.0572 583.7992 617.7607 630.2243 634.4531 720.8754 732.9868 793.3283 799.1441 827.9806 836.5073 887.7433 922.9827 972.5190 1000.8341 1018.4528 1044.0943 1055.5730 1066.1113 1094.3490 1135.6984 1179.1325 1218.9344 1236.0895 1241.5796 1266.8834 1279.2769 1311.8147 1355.8860 1379.7860 1388.9161 1404.1932 1449.0666 1465.6909 1475.2485 1477.5755 1490.5683 1588.4293 1600.4981 1690.3448 2985.1800 2998.4115 3002.2777 3052.4810 3078.4352 3081.0105 3098.2358 3152.3703 3155.6234 3176.7112 3519.6299
redmass: 7.2277 6.3646 9.3949 2.8182 6.9061 3.6253 4.4291 1.4577 7.4738 1.7194 4.1459 5.5435 5.0397 5.6571 3.8681 3.4892 2.0544 3.2446 3.9646 4.0708 5.0089 4.4396 1.6333 4.5235 3.2958 1.2206 1.5073 4.4960 4.6171 1.4016 1.3490 2.4426 2.9919 3.0293 2.3344 2.2419 1.8509 1.8195 1.9160 1.9200 1.6908 1.5532 1.2867 1.7778 1.2459 1.4227 1.5306 4.1581 1.4411 3.1251 1.0834 1.3714 1.0542 1.7068 1.0796 7.1651 7.7098 9.0801 1.0352 1.0596 1.0623 1.1017 1.0987 1.1002 1.1011 1.0882 1.0923 1.0966 1.0643
irintensity: 0.6038 0.9390 0.5515 0.1609 1.5817 0.2815 1.8935 0.5940 0.9499 1.2481 3.8783 0.4783 0.6383 1.9648 9.0921 10.0888 38.6871 6.2642 28.6296 1.1355 5.1628 25.3782 145.2852 5.5433 0.8318 11.0078 48.8664 18.2373 17.9663 17.4000 0.2439 20.2174 165.2717 143.4824 83.1171 31.5280 8.5054 12.1775 79.7076 81.1772 6.0422 66.9428 12.7139 6.6143 1.3462 1.0995 17.6249 8.0699 8.6972 15.1462 45.6896 51.9685 16.7958 95.9673 13.4227 1.6399 4.6140 194.8365 41.1728 34.5545 28.2146 7.2369 5.7783 46.8603 28.5268 13.4239 1.4633 4.2219 32.3304
temp: 298.150 k
press: 1.00000 atm
elementType: 17 8 8 8 6 6 6 6 6 6 6 6 6 6 1 1 1 1 1 1 1 1 1 1 1
symmnumber: 1
zpe: 497760.1 jmol-1
zpe.correction: 0.189587 hartree
zpe.thermalcorrener: 0.203670 hartree
zpe.thermalcorrenthalpy: 0.204615 hartree
zpe.thermalcorrgfe: 0.146650 hartree
zpe.sumelectzpe: -1072.345191 hartree
zpe.sumelectthermal: -1072.331107 hartree
zpe.sumelectthermalent: -1072.330163 hartree
zpe.sumelectthermalfe: -1072.388128 hartree
dipole: -3.5321 -0.7267 -1.3577
dipole: 3.8532
quadrupole: -85.1017 -80.9361 -93.0201
quadrupole: 9.5148 0.9146 -2.0997
quadrupole: 1.2509 5.4165 -6.6675 9.5148 0.9146 -2.0997
hfenergy: -1072.5347775 hartree
pointgroup: C01 [X(C10H11Cl1O3)]
dipole: -1.3375169 0.5499853 0.4547073 debye
dipolederiv: -0.8177956 -0.1186455 0.1858288 -0.1022613 -0.1530324 0.0440121 0.2056782 0.0526218 -0.1338382 -1.6306619 0.1998537 0.149123 0.1148174 -0.3158766 0.02301 0.3208143 -0.0449117 -0.3308158 -0.9100999 0.4594754 0.0301738 0.5520535 -0.9339709 0.0316569 -0.1328136 0.1244149 -0.2588752 -0.5322507 0.1755129 -0.0740697 0.2608544 -0.6030258 -0.1085607 0.0154372 -0.3167639 -0.7165151 -0.1933568 0.057573 -0.0057857 0.187112 0.2790155 -0.1057263 -0.0365241 -0.0915112 -0.0633212 0.0623511 -0.1424153 0.0210411 -0.0859368 0.0433962 -0.0155511 -0.0099584 -0.1095292 0.1068601 1.3551634 -0.0161373 -0.2186657 0.1777393 -0.0827406 0.0250483 -0.3470089 0.0718707 0.1397032 -0.187213 -0.11543 0.0360192 -0.0437392 -0.0519023 -0.0154155 0.0175007 0.0094204 -0.1158443 -0.1664598 0.0610859 -0.0107676 -0.1877254 -0.0151376 -0.0307931 0.0732587 -0.0856204 -0.1624857 0.0494972 0.0105059 -0.0553764 -0.0235599 0.0056363 -0.0130992 -0.0108142 0.0833798 0.0103375 1.0980958 0.2066968 -0.3089068 0.1058351 0.0502728 -0.0687256 -0.3022993 -0.0865156 0.0256909 -0.2138789 -0.1225189 0.0417373 -0.0049688 -0.0155537 -0.0348865 0.0122618 -0.0050049 -0.1146818 0.7904119 -0.1679241 0.0356951 -0.4542037 0.368228 0.0301976 -0.0435381 0.0228264 -0.0110748 0.9018558 -0.6700761 0.1243037 -0.7462731 1.0836738 0.1179262 0.2113584 0.2252641 0.9297583 -0.1009391 0.1091905 -0.107914 0.0500113 -0.0238075 0.0476184 -0.0456561 0.0256023 0.0473154 0.0282157 -0.0280938 0.1134399 -0.016162 0.035398 -0.0358327 0.0784613 0.0008029 -0.0697444 0.0474626 0.0740042 0.0039984 0.081372 0.0143554 0.0274316 0.0017343 0.0253214 0.1393894 -0.016174 0.1048025 0.0110957 0.1169431 0.0005678 0.0329333 0.0117231 0.029693 0.142782 -0.0377041 0.067125 -0.0688992 0.1057295 0.0795735 0.0322763 -0.0428424 0.0249515 0.0525429 0.057446 -0.1202244 0.0178026 -0.1097923 -0.2016302 0.0655017 0.0124071 0.0639209 0.0513869 -0.0083795 0.0419976 0.1222829 -0.0055231 0.0886938 -0.0310501 0.0749243 -0.0642385 -0.0756764 0.0778435 -0.0343673 0.0291786 -0.0382783 -0.0077182 0.0619127 0.0332312 0.0648447 0.1399976 -0.0651234 0.0078646 0.0400922 -0.0251286 0.0996569 0.0499987 0.0369062 0.0207588 0.0743026 0.0402326 -0.0494738 -0.0670941 0.082746 -0.0929516 -0.0698234 -0.0593922 -0.009048 0.0780949 0.3714613 0.0096186 -0.0443332 0.0083388 0.3488793 -0.0600594 -0.0748497 -0.0325502 0.1147112 unknown
polarizability: 165.5423446|-3.6325122|128.9238435|-14.4865181|-12.5209783|84.4602842 unknown
InChI: InChI=1S/C10H11ClO3/c1-2-7-5-8(11)3-4-9(7)14-6-10(12)13/h3-5,12H,2,6H2,1H3
charge 0 multiplicity 1
25 atoms
Cl 4.442041 0.762528 -1.019282
O  -1.264446 -0.209613 0.679011
O  -3.655175 2.130098 -0.847163
O  -2.568021 0.315827 -1.830538
C  0.970251 -0.993223 0.34664
C  0.515342 -2.36218 0.822622
C  0.047995 0.08786 0.236858
C  2.308815 -0.761113 -0.042552
C  0.447362 1.350173 -0.255494
C  -0.244281 -3.142122 -0.285442
C  2.701376 0.502428 -0.526853
C  1.790599 1.56389 -0.643321
C  -2.273861 0.823071 0.593684
C  -2.801443 1.017541 -0.831686
H  1.394925 -2.94695 1.15054
H  -0.152551 -2.248227 1.696067
H  3.039721 -1.572393 0.033389
H  -0.260415 2.177869 -0.359486
H  -1.128702 -2.574248 -0.621205
H  -0.583052 -4.12326 0.09462
H  0.405088 -3.31646 -1.162195
H  2.108817 2.536309 -1.028845
H  -3.110468 0.469937 1.220987
H  -1.933037 1.79445 1.000289
H  -4.05048 2.241009 -1.754045
