program: Gaussian 09
title: 000248817
version: EM64L-G09RevD.01
frameworkgroup: C1[X(C6H14N4)]
method: RPBEPBE
basis: SDD
operation: Freq
keyword: #pfreq=noraman
keyword: PBEPBE/SDD
title: #p freq=noraman PBEPBE/SDD
converged: YES YES NO NO
title: Mulliken charges:
elementType: N N N N C C C C C C H H H H H H H H H H H H H H
charge: -0.108926 -0.169395 -0.624309 -0.623560 -0.352569 -0.340400 -0.418074 -0.693078 -0.240763 0.242487 0.206967 0.189703 0.191960 0.196108 0.193363 0.210163 0.209816 0.211224 0.214756 0.222733 0.303381 0.327628 0.298957 0.351831
chargesum: 0.00000
title: Mulliken charges with hydrogens summed into heavy atoms:
elementType: N N N N C C C C C C
charge: -0.108926 -0.169395 0.006700 0.027227 0.044101 0.047667 -0.014548 -0.057282 -0.018030 0.242487
polarizability: 1.70823971e+02 -6.97220968e+00 8.59840578e+01 1.42732767e+01 -1.47194279e+00 6.68826235e+01
1716.lowfreq: -0.0004 0.0005 0.0007 2.7776 6.2829 13.8490 31.8824 63.1408 69.6707
frequency: 31.7052 63.1398 69.4618 110.8379 136.4921 157.3535 193.4403 231.9856 251.6112 286.1546 320.1929 362.2482 401.9000 421.8455 452.9909 533.1335 549.3401 601.8833 640.3856 726.4114 729.8787 786.4540 883.6598 889.6226 911.9914 939.8846 993.7478 1007.2756 1043.6275 1055.5500 1069.8479 1104.1246 1121.9277 1162.5182 1210.6726 1245.7026 1272.0903 1288.1093 1307.1542 1335.2817 1349.8347 1389.3912 1450.7520 1466.7457 1475.8390 1477.6626 1486.1034 1487.0088 1536.1503 1592.6216 1608.2735 1633.2577 2951.0352 2961.9865 2970.8655 2972.1859 3002.9508 3013.0795 3027.0388 3050.7857 3069.6330 3070.3466 3476.1154 3544.2380 3664.1792 3692.9878
redmass: 3.5929 3.8830 1.7459 2.4991 4.5357 2.5962 2.5726 1.1250 1.8550 2.1067 2.4411 2.9220 1.5449 2.0104 2.6762 1.2337 3.0715 3.4252 2.5122 1.6112 1.0975 1.2320 1.5680 1.9614 3.1503 1.3788 2.3302 3.2762 1.5009 1.9683 2.4940 2.0155 2.3398 2.1138 1.4445 1.3000 1.1805 1.0731 1.3203 1.5665 1.6046 1.2155 1.0891 1.0704 1.0698 1.0423 2.6756 1.0938 2.1796 1.7113 2.7254 2.1042 1.0640 1.0586 1.0605 1.0369 1.0976 1.0874 1.0993 1.1001 1.1006 1.0994 1.0484 1.0449 1.0987 1.1034
irintensity: 1.9112 1.1172 0.1467 2.9598 11.6181 5.2848 6.9523 0.6141 62.1226 49.7094 48.5924 25.7598 155.1569 85.5297 32.0191 168.6002 8.2852 1.4816 33.6095 154.0818 18.7058 0.0786 10.7023 15.9320 31.2041 19.6580 0.6063 4.4752 7.7869 10.5968 2.0421 7.1547 51.1507 1.7976 2.1473 0.8569 1.5680 0.8251 3.7295 10.3186 0.7202 11.1930 7.5523 0.8959 4.8994 12.3613 49.3001 10.5681 272.7419 343.6208 22.1448 537.4351 27.5739 3.6726 69.9002 53.1381 2.7493 23.8603 10.3868 49.0976 96.8424 59.6131 40.2470 49.1098 50.5818 27.3211
temp: 298.150 k
press: 1.00000 atm
elementType: 7 7 7 7 6 6 6 6 6 6 1 1 1 1 1 1 1 1 1 1 1 1 1 1
symmnumber: 1
zpe: 540249.7 jmol-1
zpe.correction: 0.205770 hartree
zpe.thermalcorrener: 0.218251 hartree
zpe.thermalcorrenthalpy: 0.219195 hartree
zpe.thermalcorrgfe: 0.166495 hartree
zpe.sumelectzpe: -455.207838 hartree
zpe.sumelectthermal: -455.195357 hartree
zpe.sumelectthermalent: -455.194413 hartree
zpe.sumelectthermalfe: -455.247113 hartree
dipole: -2.1630 1.2862 -0.5663
dipole: 2.5795
quadrupole: -37.9662 -57.8023 -64.6805
quadrupole: -3.6582 4.5044 -1.9543
quadrupole: 15.5168 -4.3193 -11.1975 -3.6582 4.5044 -1.9543
hfenergy: -455.4136083 hartree
pointgroup: C01 [X(C6H14N4)]
dipole: -0.8448457 -0.5375464 0.1648289 debye
dipolederiv: 0.5381171 0.0479907 -0.1619482 -0.4579858 -0.3784947 0.0760696 -0.2033782 -0.0128758 -0.130389 -1.7207857 -0.1945717 0.2478872 -0.1203231 -0.4461048 0.0148864 0.2978966 0.0568022 -0.3172028 -1.3756471 0.2711313 0.3176836 0.3709087 -0.4062209 0.0187863 0.5860825 0.0168851 -0.8337216 -0.5839958 -0.1251287 -0.1472831 -0.4539592 -1.1436503 -0.0683254 -0.2362515 -0.2154821 -0.5621711 -0.0131081 0.0302572 -0.0108176 0.1897829 0.1542291 -0.0615039 0.1128701 -0.0397283 0.0814212 0.045201 0.0167595 -0.0276868 -0.0677636 0.1411886 -0.0365266 -0.1243327 -0.0382281 0.125968 -0.2138985 0.0330084 -0.0289272 -0.0611505 0.0601064 -0.0111654 -0.0453153 -0.0425709 0.1446173 -0.0880241 -0.0125272 -0.0660595 0.0371019 0.0842435 -0.0186132 -0.021439 -0.0195662 0.0405594 0.1736585 -0.0152254 -0.0536478 -0.2240022 0.3367255 0.0129186 -0.1386018 -0.0024623 -0.149443 2.2343133 0.0089744 -0.4579066 0.7478353 1.3901732 0.0061489 -0.4770829 0.0580572 0.3213534 0.0368873 -0.0038572 0.0472982 -0.0087 0.0544477 0.0591327 0.0355453 0.0352158 -0.1568269 0.050886 -0.0201456 -0.0130756 -0.0240597 -0.1949511 -0.0247919 0.0013087 0.0020415 0.0621711 0.015883 -0.0021046 0.0317161 -0.0120606 0.0596658 0.0704207 0.0670544 0.0397852 -0.1947516 0.0289753 -0.0549314 -0.0180168 -0.0059836 -0.2003868 -0.0303424 -0.0079565 -0.0106458 0.065438 -0.0619047 -0.0194524 0.1114915 0.0401247 0.0766721 0.0550932 0.1003114 0.0383614 -0.1447137 0.057013 -0.0396355 -0.0123172 0.0198172 -0.1456117 -0.026079 -0.0276382 0.0171063 0.072493 0.0869443 -0.0134796 -0.0162788 -0.0789223 -0.1841268 -0.0194071 -0.0196396 0.0128085 0.0733851 0.0744438 -0.0323087 0.081969 -0.0302717 0.0683308 0.0664674 0.0115822 0.0534902 -0.1608026 -0.2158233 0.0920117 0.0171138 0.1175603 0.0455396 -0.0265425 0.0306581 -0.0344576 0.0718638 0.0026248 -0.0031322 0.0314201 -0.0124764 -0.1677697 0.0105272 0.0577102 -0.0058502 0.1580343 0.1692286 -0.0313966 -0.0110401 0.0123562 0.1683816 -0.0791854 -0.1911134 -0.0635558 0.3955935 0.2281237 -0.0467706 0.0023101 -0.0564939 0.1703661 -0.0079643 -0.036054 0.0206124 0.3875455 0.2161446 0.0156309 0.1049875 -0.0148997 0.1965099 0.0111143 0.179921 0.0936785 0.326424 0.314743 0.0989034 0.0311281 0.093565 0.2607369 0.0088819 0.0478624 0.040579 0.3231551 unknown
polarizability: 170.6429208|9.5035422|86.2894978|-13.2985301|0.5000354|66.7582338 unknown
InChI: InChI=1S/C6H14N4/c1-2-3-4-5-9-10-6(7)8/h5H,2-4,7-8H2,1H3
charge 0 multiplicity 1
24 atoms
N  -0.920825 -0.115238 -0.274214
N  -2.078094 0.688815 -0.013722
N  -4.334751 0.514704 0.576403
N  -3.139914 -1.472542 0.062551
C  2.592512 0.287893 0.18797
C  3.95156 -0.371281 -0.139456
C  1.475421 -0.117152 -0.812093
C  5.065622 0.027218 0.852223
C  0.1649 0.572388 -0.529568
C  -3.145394 -0.09613 0.199476
H  2.280267 0.00885 1.214089
H  2.7098 1.391508 0.185095
H  4.252739 -0.091546 -1.169991
H  3.830764 -1.473815 -0.13972
H  1.815969 0.140649 -1.838232
H  1.318717 -1.212008 -0.784997
H  5.226659 1.121911 0.848659
H  4.801151 -0.268479 1.885065
H  6.026794 -0.456571 0.597746
H  0.144744 1.678514 -0.528754
H  -5.230027 0.070251 0.389213
H  -4.3004 1.527761 0.671739
H  -3.845549 -2.06052 0.497114
H  -2.216065 -1.848681 -0.170397
