program: Gaussian 09
title: 000248815
version: EM64L-G09RevD.01
frameworkgroup: C1[X(C6H8N4S)]
method: RPBEPBE
basis: SDD
operation: Freq
keyword: #pfreq=noraman
keyword: PBEPBE/SDD
title: #p freq=noraman PBEPBE/SDD
converged: YES YES NO NO
title: Mulliken charges:
elementType: S N N N N C C C C C C H H H H H H H H
charge: 0.233234 -0.118076 -0.156370 -0.622364 -0.621301 -0.088344 -0.280692 -0.128254 -0.518281 -0.270408 0.261719 0.260619 0.241366 0.262972 0.235746 0.310140 0.336121 0.357852 0.304321
chargesum: 0.00000
title: Mulliken charges with hydrogens summed into heavy atoms:
elementType: S N N N N C C C C C C
charge: 0.233234 -0.118076 -0.156370 0.023898 0.040873 -0.088344 -0.020073 0.113112 -0.255309 -0.034662 0.261719
polarizability: 2.68131645e+02 -2.35172870e+00 1.10125748e+02 -3.22050256e-01 1.37673120e-01 4.36156455e+01
1716.lowfreq: -12.0505 -5.7849 -0.0001 0.0016 0.0016 2.7765 37.8035 72.9751 76.2308
frequency: 37.7770 72.9740 76.2238 163.3734 177.9564 203.1725 264.0605 269.7760 350.4322 404.9100 407.1029 448.9524 487.2354 520.6520 576.9827 578.4439 614.8044 642.3323 685.5707 693.9690 720.1950 775.2754 822.3351 825.3201 907.5851 936.5605 939.6087 1001.1156 1031.0559 1050.3211 1077.8654 1114.3815 1156.9581 1236.9502 1338.7334 1346.0701 1459.4682 1493.5434 1505.2495 1533.1652 1576.0700 1589.0160 1625.8425 3044.4368 3170.0240 3193.0313 3239.5843 3480.9458 3553.7016 3674.6124 3704.9880
redmass: 4.8796 4.9222 4.8682 4.3023 1.5882 3.8038 4.2982 2.5918 4.3457 3.4055 1.4157 2.5728 4.3847 1.1897 6.3881 3.7946 4.2744 2.5704 1.1649 6.9561 1.6298 5.3317 4.6667 1.3056 1.3701 1.5877 3.6041 2.1957 1.6460 1.8041 1.2470 2.0879 2.4483 1.4455 1.6605 2.8047 6.5599 2.2822 3.6157 5.0118 2.7902 1.9976 1.5298 1.0876 1.0896 1.0975 1.0995 1.0487 1.0451 1.0990 1.1042
irintensity: 1.6282 5.9260 2.3880 18.9808 74.3118 20.9350 7.0206 19.6048 32.4572 60.5104 283.1322 20.3695 19.1984 110.7569 3.4132 1.0743 3.2569 30.9913 99.6998 5.4278 156.3956 47.1223 18.2925 23.5739 0.0424 26.4251 53.5881 1.5142 17.5612 1.9094 14.9173 76.3618 20.8823 20.3233 10.4613 9.4862 1.1831 294.9505 362.1971 59.5064 38.8144 457.6239 660.8283 18.7934 12.6744 2.8778 0.7950 26.4742 108.2147 70.2707 36.5283
temp: 298.150 k
press: 1.00000 atm
elementType: 16 7 7 7 7 6 6 6 6 6 6 1 1 1 1 1 1 1 1
symmnumber: 1
zpe: 369650.3 jmol-1
zpe.correction: 0.140792 hartree
zpe.thermalcorrener: 0.152011 hartree
zpe.thermalcorrenthalpy: 0.152956 hartree
zpe.thermalcorrgfe: 0.102866 hartree
zpe.sumelectzpe: -849.658072 hartree
zpe.sumelectthermal: -849.646853 hartree
zpe.sumelectthermalent: -849.645908 hartree
zpe.sumelectthermalfe: -849.695998 hartree
dipole: 3.9564 2.3008 0.0484
dipole: 4.5770
quadrupole: -37.0813 -63.9991 -78.3131
quadrupole: 2.6387 0.7941 -0.6389
quadrupole: 22.7166 -4.2013 -18.5153 2.6387 0.7941 -0.6389
hfenergy: -849.798864 hartree
pointgroup: C01 [X(C6H8N4S1)]
dipole: -1.4937452 1.0056281 -0.0108446 debye
dipolederiv: 0.0792354 -0.0307012 -0.0001692 0.1844759 -0.3041339 -0.0091809 0.0032235 -0.0082946 0.1234933 1.0464103 -0.0672011 -0.004286 0.4650327 -0.3310503 -0.0030434 -0.0160242 -0.0019659 -0.1566176 -2.4230638 0.2122748 0.0062566 0.3580725 -0.4336455 0.0025558 -0.0399792 -0.010906 -0.2717218 -1.9772037 -0.2455431 0.1342552 -0.3688645 -0.3555338 -0.0677757 0.3946728 -0.0571129 -0.7070236 -0.4745381 0.0133649 -0.0797116 0.7114721 -1.1418203 0.092809 -0.1809279 0.1617566 -0.645312 0.46683 -0.2125711 -0.0067175 -0.2740855 0.2176663 0.0091001 -0.0067688 0.0096107 -0.1580776 -0.0474553 -0.0660696 -0.0025008 -0.1491435 -0.218064 0.0000722 -0.0029482 -0.0009943 -0.1660259 -0.088281 0.1322204 0.0019262 0.2277169 -0.1049078 -0.0002911 0.005368 0.0000099 -0.1385092 -0.4476532 0.158674 0.0030377 -0.2038961 0.3003946 0.0130481 -0.0034456 0.0117837 -0.3503524 -0.1663009 0.0498137 -0.000696 0.5527957 0.2629112 0.0026943 0.0192633 0.0067533 -0.059272 2.9392364 0.0262085 -0.0616817 -1.372623 1.3761753 -0.0545286 -0.0685125 -0.0184199 0.2265044 0.0548467 0.0778623 0.0021461 0.0892789 0.0068313 -0.0042756 0.0015816 -0.0034018 0.1956717 0.0447372 -0.0594115 -0.0006119 -0.1227631 -0.0504226 -0.0042732 -0.0017772 -0.0044471 0.1938291 -0.0118559 0.0102898 0.0012014 -0.0067149 0.0833247 -0.0028074 0.0002083 -0.0028259 0.22845 0.0324013 0.0100546 0.001325 -0.0236501 -0.1093237 -0.0054714 -0.0003293 -0.0057047 0.1784957 0.2586554 0.0218071 -0.0293507 -0.0375554 0.1533438 0.0523593 -0.2018123 0.0513074 0.3808531 0.2656836 0.0484454 -0.0211346 0.1110666 0.187599 0.0079743 -0.0575576 -0.0095028 0.3859679 0.2714442 -0.0853707 0.0098038 -0.1344357 0.2606386 -0.0176244 0.0368467 -0.0434736 0.3424507 0.1768715 0.0058528 0.0469079 -0.0061797 0.2000172 -0.0113415 0.1189187 -0.0741721 0.3971962 unknown
polarizability: 267.7519019|-8.0325578|110.5002343|-1.1530858|0.1032117|43.6209019 unknown
InChI: InChI=1S/C6H8N4S/c7-6(8)10-9-4-5-2-1-3-11-5/h1-4H,7-8H2
charge 0 multiplicity 1
19 atoms
S  2.86482 -1.444545 -0.036659
N  -0.945529 -0.037857 0.008162
N  -2.177326 -0.73175 -0.001265
N  -4.483942 -0.394811 0.073557
N  -3.058797 1.505304 -0.058322
C  1.456542 -0.293878 -0.007739
C  1.913755 1.0279 0.015847
C  3.344688 1.151295 0.011643
C  4.011284 -0.067629 -0.0148
C  0.111976 -0.832921 -0.01197
C  -3.209217 0.137466 0.003825
H  1.223819 1.873929 0.03594
H  3.867792 2.11086 0.027945
H  5.080984 -0.267774 -0.023054
H  -0.020131 -1.927912 -0.03308
H  -5.307451 0.146212 -0.173472
H  -4.545638 -1.409579 0.119755
H  -2.080343 1.806665 -0.07598
H  -3.809187 2.158926 0.142769
