program: Gaussian 09
title: 000248813
version: EM64L-G09RevD.01
frameworkgroup: C1[X(C9H10N4O2)]
method: RPBEPBE
basis: SDD
operation: Freq
keyword: #p
keyword: freq=noraman
keyword: PBEPBE/SDD
title: #p freq=noraman PBEPBE/SDD
converged: NO YES NO NO
title: Mulliken charges:
elementType: O O N N N N C C C C C C C C C H H H H H H H H H H
charge: -0.272422 -0.264050 -0.139437 -0.157070 -0.629102 -0.627693 0.216477 0.169404 -0.497317 0.492198 -0.332577 -0.201296 -0.389145 -0.396797 0.268519 0.268398 0.248619 0.234993 0.234996 0.230281 0.231819 0.310934 0.337335 0.359639 0.303294
chargesum: 0.00000
title: Mulliken charges with hydrogens summed into heavy atoms:
elementType: O O N N N N C C C C C C C C C
charge: -0.272422 -0.264050 -0.139437 -0.157070 0.019168 0.035239 0.216477 0.169404 -0.228919 0.492198 -0.083958 0.268693 -0.158864 -0.164979 0.268519
polarizability: 3.06502649e+02 1.24366412e+01 1.40579748e+02 2.19758174e-02 -6.98976351e-03 5.77565258e+01
1716.lowfreq: -131.3990 -54.9943 -4.2057 -0.0006 -0.0003 0.0006 3.2253 5.3237 41.6796
frequency: -131.3987 -54.9734 41.6098 60.9334 62.8168 141.5755 187.6694 218.0595 225.0678 261.1524 313.9244 368.4550 368.7395 380.6333 428.8107 438.1962 456.1908 500.0335 543.2623 611.8700 614.3083 641.8783 646.3141 680.0328 712.9625 720.0550 765.0095 786.8305 809.8234 843.9746 888.8374 912.8160 924.6804 946.0357 955.4095 979.9286 997.6915 1041.7390 1053.6716 1065.0844 1114.7579 1119.3205 1138.0865 1187.6650 1251.5197 1259.6352 1341.4227 1365.4711 1386.5976 1451.8276 1474.2779 1486.8165 1494.8381 1512.9277 1579.4485 1585.9260 1605.5425 1622.8755 1625.6020 3007.6280 3035.5234 3083.2450 3139.1415 3180.2066 3186.9847 3490.2695 3566.4003 3686.1711 3721.4477
redmass: 1.3396 2.3490 4.5304 5.4356 4.0307 5.7600 4.7667 5.8303 3.9048 6.2892 3.3793 1.8615 5.0264 2.2096 3.2098 3.3730 3.6928 1.1574 5.3035 6.6828 4.2630 2.2233 5.4641 9.6776 1.8696 3.2196 6.9106 5.5302 1.3605 10.8095 1.4164 4.5925 1.3495 3.5049 1.5214 4.6078 1.8226 2.0497 3.7200 1.4591 2.3178 1.0364 1.6236 1.8547 1.7098 2.1674 1.9813 1.2935 3.8341 4.7774 2.9040 1.1872 2.0175 3.6686 2.6948 2.2182 6.7034 3.0410 2.4700 1.0533 1.0877 1.1188 1.0895 1.0953 1.0928 1.0486 1.0451 1.0996 1.1049
irintensity: 2.6785 13.3626 3.1790 1.3809 0.8457 15.0831 4.4409 1.6662 0.6436 2.2520 35.6679 221.6616 1.1744 200.2804 15.7648 10.6155 16.3089 42.5529 15.2768 4.8049 15.1699 24.7574 3.5655 0.5188 77.7579 40.1161 20.0741 8.9054 38.5446 20.9864 18.6381 67.3253 12.9627 19.7185 31.8626 173.0251 3.1129 4.2510 3.2461 4.3013 126.4101 0.0030 19.4540 49.6927 80.9993 191.4726 48.4568 4.0755 11.1592 115.5303 209.7240 9.4131 63.7302 564.2901 16.1840 480.3211 18.8673 243.7939 469.5983 156.0265 28.8533 36.3405 10.6709 9.8812 2.1700 30.5985 128.6768 78.3130 43.0110
temp: 298.150 k
press: 1.00000 atm
elementType: 8 8 7 7 7 7 6 6 6 6 6 6 6 6 6 1 1 1 1 1 1 1 1 1 1
symmnumber: 1
zpe: 492249.3 jmol-1
zpe.correction: 0.187488 hartree
zpe.thermalcorrener: 0.200026 hartree
zpe.thermalcorrenthalpy: 0.200971 hartree
zpe.thermalcorrgfe: 0.147670 hartree
zpe.sumelectzpe: -717.275307 hartree
zpe.sumelectthermal: -717.262769 hartree
zpe.sumelectthermalent: -717.261824 hartree
zpe.sumelectthermalfe: -717.315125 hartree
dipole: -3.1374 -2.5044 -0.0006
dipole: 4.0144
quadrupole: -47.6376 -75.9311 -91.9489
quadrupole: 7.2705 -0.0009 0.0044
quadrupole: 24.2016 -4.0919 -20.1097 7.2705 -0.0009 0.0044
hfenergy: -717.462795 hartree
pointgroup: C01 [X(C9H10N4O2)]
dipole: 1.2353702 -0.9840285 0.0002378 debye
dipolederiv: -1.0275452 -0.3914833 -0.0000323 -0.7323027 -0.8372392 -0.0000224 -0.0000318 -0.0000037 -0.256892 -1.6082279 -0.3944154 -0.0000775 -0.6754189 -0.6571612 -0.0000161 -0.0001014 -0.0000123 -0.2470005 1.1098507 -0.2952016 0.0000743 0.2864774 -0.3549218 0.0000029 0.0002998 -0.0000643 -0.1592451 -2.3438095 0.4711835 -0.0000941 0.6796983 -0.5745287 -0.0000338 0.0003082 0.0000322 -0.2832702 -2.1170147 0.006196 -0.0011065 -0.1242124 -0.2763402 0.0008744 -0.0033277 0.0011105 -0.742475 -0.3639921 -0.1371176 0.0006162 0.5854705 -1.2031989 -0.001138 0.0018148 -0.0020714 -0.6686377 0.1695248 0.2652596 0.0000042 1.129253 0.7742066 0.0000506 -0.00005 -0.0000149 0.0493344 1.3520146 0.5342745 0.000076 0.117121 -0.0209365 0.0000158 0.000125 0.0000572 0.0195573 -0.1608109 -0.1138729 0.0000153 -0.1148576 -0.0518107 -0.000025 0.0000109 -0.0000036 -0.168725 0.339829 -0.0375509 0.0000196 -0.0854902 -0.0601874 -0.0000119 0.0000009 -0.0000167 0.015624 -0.0328204 -0.0200064 0.0000113 -0.2735201 0.0561118 -0.0000297 0.0000401 -0.0000148 -0.1554788 1.0307584 0.2878188 0.0000014 0.5655106 0.760023 0.0000136 -0.0000201 -0.0000046 0.581075 -0.1549128 -0.0393392 0.0000135 0.1238794 0.0120556 -0.0000015 0.0000048 -0.0000111 -0.2058523 0.028624 0.1287144 0.0000338 0.4506724 0.2403466 0.0000473 -0.0000538 0.0000126 -0.1064928 2.7693368 -0.1491252 0.0007309 -1.63569 1.5855565 0.0006234 0.0003633 0.0004105 0.2387985 0.0985668 0.0816904 -0.0000123 0.0512888 0.0165693 0.0000137 -0.0000068 0.000007 0.1701555 0.005419 0.0872652 -0.0000189 0.0934452 0.0127253 0.000016 -0.0000209 0.0000151 0.1788161 -0.0600464 -0.0767142 0.0553846 -0.1202509 -0.0003994 0.0437149 0.1577173 0.1028902 -0.0771222 -0.0600188 -0.0767107 -0.055373 -0.1202662 -0.0004145 -0.043742 -0.1576772 -0.1028998 -0.0771105 0.0617494 -0.0987628 -0.000006 -0.0646413 -0.0674574 0.000008 -0.0000091 0.000002 0.1652597 0.0065581 -0.0200795 -0.0000191 -0.0683097 -0.1349245 -0.0000021 -0.0000112 0.0000002 0.1725968 0.2469775 0.0098919 0.0001375 -0.0306291 0.1425912 -0.0005348 0.0015875 -0.0007514 0.4024219 0.2888745 0.0365835 0.0001582 0.102871 0.169573 -0.0001518 0.000482 -0.0000662 0.3948068 0.2587744 -0.0800341 -0.0000782 -0.1437583 0.283428 0.0001683 -0.0003151 0.0004736 0.3457459 0.1623411 0.021536 -0.0004589 0.0036597 0.1863334 0.0001601 -0.0011291 0.0009239 0.4141103 unknown
polarizability: 306.5284096|-12.2635706|140.5539873|0.0219685|0.0070127|57.7565258 unknown
InChI: InChI=1S/C9H10N4O2/c10-9(11)13-12-4-6-1-2-7-8(3-6)15-5-14-7/h1-4H,5,10-11H2
charge 0 multiplicity 1
25 atoms
O  -2.793169 -1.899012 -0.000166
O  -4.306366 -0.030246 -0.000394
N  2.158418 0.145425 0.000135
N  3.49441 0.611393 0.000261
N  5.706587 -0.114764 0.00092
N  3.970826 -1.74416 -0.00072
C  -2.068687 -0.676397 -0.000159
C  -2.961781 0.419938 -0.000292
C  -0.689011 -0.514388 -0.000042
C  -0.18453 0.829331 -0.000066
C  -2.502124 1.738472 -0.000315
C  -4.228545 -1.516405 -0.000268
C  -1.094967 1.925478 -0.000199
C  1.253391 1.106456 0.000061
C  4.359391 -0.423068 0.000172
H  0.003342 -1.358778 0.000074
H  -3.194844 2.583627 -0.000418
H  -4.704567 -1.899474 0.91936
H  -4.704476 -1.899625 -0.919879
H  -0.69516 2.945857 -0.000213
H  1.574248 2.162791 0.00008
H  6.434967 -0.820828 -0.001127
H  5.949261 0.872662 0.0016
H  2.955975 -1.874113 -0.000902
H  4.612411 -2.529774 0.001201
