program: Gaussian 09
title: 000248809
version: EM64L-G09RevD.01
frameworkgroup: C1[X(C9H12N4)]
method: RPBEPBE
basis: SDD
operation: Freq
keyword: #pfreq=noraman
keyword: PBEPBE/SDD
title: #p freq=noraman PBEPBE/SDD
converged: YES YES NO NO
title: Mulliken charges:
elementType: N N N N C C C C C C C C C H H H H H H H H H H H H
charge: -0.134212 -0.155136 -0.622868 -0.621166 0.441497 0.435208 -0.390267 -0.381527 -0.380468 -0.372328 -0.808193 -0.389938 0.252788 0.226577 0.224735 0.222968 0.244036 0.223578 0.223803 0.234485 0.227630 0.307606 0.333182 0.355445 0.302564
chargesum: 0.00000
title: Mulliken charges with hydrogens summed into heavy atoms:
elementType: N N N N C C C C C C C C C
charge: -0.134212 -0.155136 0.017921 0.036842 0.441497 0.435208 -0.163690 -0.156792 -0.157500 -0.128292 -0.126327 -0.162308 0.252788
polarizability: 2.96915154e+02 8.11664674e+00 1.25778112e+02 6.61296877e-02 -8.47700305e-02 5.69460571e+01
1716.lowfreq: -18.2775 -0.0007 -0.0005 -0.0005 5.1932 6.5205 11.9831 41.0610 58.3841
frequency: -18.1209 40.6013 58.3553 70.0538 129.3282 192.6624 203.3237 219.4851 264.2552 305.4947 332.8030 380.1099 406.3710 410.3811 435.5583 440.2497 518.0355 527.6364 552.7199 623.8928 636.5986 660.0816 717.7781 726.7681 765.2184 827.8835 846.1349 850.2923 934.1814 942.1060 968.7174 980.5256 984.7599 1007.5275 1009.8051 1045.0744 1050.0869 1116.0953 1127.9513 1184.5226 1223.3417 1236.9810 1305.8585 1341.4263 1371.5703 1394.9223 1412.5320 1470.1799 1472.1672 1493.2128 1506.3087 1513.7108 1567.8100 1587.6336 1591.7146 1622.4765 1627.6930 2970.1905 3028.2271 3050.7965 3081.4584 3110.6388 3115.9659 3135.2792 3154.3895 3481.9630 3550.3655 3671.6141 3700.9963
redmass: 1.0258 3.9563 4.1639 4.3820 4.9195 2.5292 2.6093 1.9938 4.9706 2.3587 2.7643 3.5555 1.3601 2.9061 3.8247 2.4192 1.4824 1.8542 4.0338 3.3613 3.9589 4.5896 1.7513 2.7130 4.3016 1.4316 4.9881 1.2714 4.4038 1.3811 1.4733 1.3716 1.4289 2.1934 2.4901 1.5598 1.8297 1.5916 2.0089 1.1182 2.8479 1.9655 1.3849 2.0386 3.4771 1.2254 3.7696 1.1080 1.0541 2.2348 2.8165 3.4466 4.3175 1.8942 3.0816 5.8733 1.6723 1.0389 1.0875 1.0944 1.0997 1.0867 1.0887 1.0965 1.0949 1.0484 1.0450 1.0991 1.1039
irintensity: 0.5678 2.8273 1.9742 1.9796 7.8073 25.7284 37.6373 81.3822 3.4445 37.8410 6.8378 21.3169 269.2651 0.3631 17.8752 38.3060 155.0875 18.6479 6.0051 8.7436 13.7192 12.8900 118.0702 32.0186 3.2174 42.3631 10.5022 4.6842 64.2035 14.4440 22.9576 1.1373 1.0651 3.6089 0.5414 24.8709 4.6034 40.7974 62.3899 4.4538 1.0130 7.9722 3.3892 13.5586 4.6627 4.1740 5.0741 23.0314 12.4640 38.9217 22.0955 633.5308 33.0052 314.3681 99.3098 1.6374 689.0199 53.9507 31.3168 25.9783 19.1670 15.6113 25.9821 35.8599 8.4994 29.2537 94.5292 67.8921 32.5386
temp: 298.150 k
press: 1.00000 atm
elementType: 7 7 7 7 6 6 6 6 6 6 6 6 6 1 1 1 1 1 1 1 1 1 1 1 1
symmnumber: 1
zpe: 528060.7 jmol-1
zpe.correction: 0.201128 hartree
zpe.thermalcorrener: 0.213551 hartree
zpe.thermalcorrenthalpy: 0.214495 hartree
zpe.thermalcorrgfe: 0.161941 hartree
zpe.sumelectzpe: -568.196743 hartree
zpe.sumelectthermal: -568.184319 hartree
zpe.sumelectthermalent: -568.183375 hartree
zpe.sumelectthermalfe: -568.235930 hartree
dipole: 2.6984 1.9941 -0.0184
dipole: 3.3554
quadrupole: -39.9054 -66.6919 -83.6078
quadrupole: 7.3260 -1.2582 0.6719
quadrupole: 23.4963 -3.2902 -20.2061 7.3260 -1.2582 0.6719
hfenergy: -568.3978705 hartree
pointgroup: C01 [X(C9H12N4)]
dipole: 1.0574578 0.7902257 0.0004143 debye
dipolederiv: 1.0459595 0.1389705 0.0073969 -0.3978166 -0.3547641 -0.002079 0.0319836 0.0016731 -0.1607691 -2.3658031 -0.2841687 -0.0084892 -0.4398989 -0.4699598 0.0043998 0.0389431 -0.0102787 -0.2737562 -1.9887994 0.1647627 -0.1551772 0.2577049 -0.3291674 -0.090979 -0.4497233 -0.0910312 -0.6987755 -0.4506535 0.0232325 0.0877391 -0.6518693 -1.1546591 0.1166573 0.2065468 0.2010536 -0.6391374 0.3353961 -0.1100049 -0.0188258 -0.0683112 -0.0164024 0.0055044 -0.1299171 0.0212117 -0.0382044 0.4075904 0.0270249 0.0055909 -0.033744 -0.1266446 -0.0041087 0.0025508 -0.0020966 0.0192169 -0.0234009 0.1027627 0.0016365 0.2860985 0.01109 -0.0008353 0.0171906 -0.0016134 -0.1700772 -0.2316921 0.0106051 0.0017588 -0.1737332 0.1315426 0.0133939 0.0034666 0.011106 -0.1702943 -0.1650481 -0.0412375 0.0000867 -0.0396039 0.1017832 0.0117291 0.0111149 0.0082001 -0.1764237 -0.1068739 0.0271926 0.0008362 0.1273653 0.0066149 0.0017238 0.0130974 -0.0004886 -0.1439644 -0.1435138 0.0567068 0.0106325 0.0590131 0.06841 -0.0029089 0.1736795 -0.0273506 0.0722533 -0.1009938 -0.0867769 0.0004249 -0.455664 0.3220173 0.0030216 -0.0181114 0.0073141 -0.0997606 2.829036 0.032051 0.0797833 1.4197633 1.4170451 -0.0687183 0.0708286 -0.0282481 0.2205153 -0.0754391 -0.1202147 -0.0073975 -0.1277806 -0.0104658 -0.0026931 -0.0130457 -0.0070902 0.1502238 0.0395477 0.0687758 -0.0021432 0.0998853 -0.1173571 -0.006824 -0.003995 -0.0014933 0.1468532 0.0737853 0.0827763 0.00052 0.0508108 -0.1055472 -0.0072133 -0.0046517 -0.0071675 0.1533787 0.0249792 -0.106177 -0.0042718 -0.0799554 0.0057132 -0.0035378 -0.00687 -0.0011791 0.1456716 0.0296769 -0.0050976 0.0045083 0.0957603 -0.1022057 0.1016642 -0.0707247 0.0935022 0.0631624 -0.0480636 -0.0404006 -0.0524461 -0.1243496 -0.0236255 -0.0943983 -0.1197597 -0.0597266 0.0545418 -0.0807778 0.0352722 0.0607955 0.0501896 0.1015577 -0.0119854 0.1300535 -0.0257749 -0.1065983 0.013752 0.0029897 -0.0018926 0.0503226 -0.1458803 -0.0051671 -0.0007645 -0.0056633 0.1707082 0.2514659 -0.015492 0.0310724 0.0482394 0.1573631 0.0650456 0.2270265 0.0727444 0.3707164 0.2755402 -0.0448126 0.0239957 -0.0939926 0.1734669 0.0129417 0.0671799 -0.0058588 0.3820401 0.276017 0.0882503 -0.0115354 0.1384877 0.2645135 -0.0201477 -0.0419727 -0.0509783 0.3389032 0.1783131 -0.0069905 -0.054599 0.0030786 0.1955617 -0.0144854 -0.1341262 -0.0907661 0.3895764 unknown
polarizability: 296.8193396|9.0275491|125.8688953|1.0296516|0.2640752|56.9510885 unknown
InChI: InChI=1S/C9H12N4/c1-7-2-4-8(5-3-7)6-12-13-9(10)11/h2-6H,10-11H2,1H3
charge 0 multiplicity 1
25 atoms
N  1.659351 -0.061719 0.014217
N  2.931978 -0.684388 0.013545
N  5.216862 -0.2172 0.103133
N  3.691308 1.597575 -0.073099
C  -3.51839 0.304237 -0.017372
C  -0.748899 -0.468796 -0.009584
C  -3.142058 -1.063305 -0.050141
C  -2.481818 1.278186 0.013889
C  -1.784758 -1.444469 -0.044659
C  -1.125427 0.905637 0.019746
C  -4.979867 0.715778 0.010872
C  0.649245 -0.910078 -0.007949
C  3.912113 0.238884 0.013889
H  -3.921396 -1.834892 -0.081551
H  -2.750747 2.342112 0.033401
H  -1.516999 -2.508427 -0.072484
H  -0.336199 1.664225 0.043661
H  -5.133083 1.700318 -0.465929
H  -5.618645 -0.019732 -0.509719
H  -5.352107 0.794683 1.05156
H  0.845555 -1.996972 -0.025313
H  6.002695 0.356658 -0.18974
H  5.333535 -1.226209 0.1689
H  2.698378 1.845952 -0.099975
H  4.399073 2.288042 0.1585
