program: Gaussian 09
title: 000248808
version: EM64L-G09RevD.01
frameworkgroup: C1[X(C13H10N2)]
method: RPBEPBE
basis: SDD
operation: Freq
keyword: #pfreq=noraman
keyword: PBEPBE/SDD
title: #p freq=noraman PBEPBE/SDD
converged: YES YES NO YES
title: Mulliken charges:
elementType: N N C C C C C C C C C C C C C H H H H H H H H H H
charge: -0.016961 -0.585747 -0.027018 0.282712 0.489706 0.457936 0.035406 -0.469508 -0.421908 -0.478304 -0.465896 -0.451777 -0.366382 -0.229193 -0.244690 0.231426 0.274227 0.240443 0.236816 0.237072 0.191832 0.224619 0.225937 0.299845 0.329407
chargesum: 0.00000
title: Mulliken charges with hydrogens summed into heavy atoms:
elementType: N N C C C C C C C C C C C C C
charge: -0.016961 0.043505 -0.027018 0.282712 0.489706 0.457936 0.035406 -0.238082 -0.147681 -0.237862 -0.229080 -0.214706 -0.174550 -0.004574 -0.018753
polarizability: 2.92219157e+02 -2.34946868e+00 1.85556279e+02 -1.09480256e-02 -2.71954806e-03 5.81979656e+01
1716.lowfreq: -11.4218 -0.0009 -0.0007 -0.0004 4.9756 6.1026 61.7661 157.2007 169.8175
frequency: 61.7614 157.2000 169.8167 204.1684 211.6785 230.3903 328.1514 346.1771 369.3255 414.6998 432.7487 467.1288 475.7622 477.0412 514.8786 520.4955 573.0587 576.2792 648.1177 654.4327 698.7125 717.3133 760.1340 781.9945 788.1603 804.9806 808.4542 871.7209 904.2159 924.1290 931.4814 962.3183 980.6771 994.3717 1037.5371 1078.5019 1104.8913 1124.4375 1155.5567 1174.9273 1187.6877 1202.5942 1217.2262 1233.6703 1256.3035 1343.3557 1384.5198 1396.3661 1407.3188 1424.3161 1439.8254 1458.6832 1501.8789 1523.9131 1579.6923 1589.3598 1594.7566 1629.0422 1647.0784 3109.5769 3121.2285 3124.1356 3130.7592 3136.9946 3146.1340 3156.0313 3168.4525 3455.3184 3672.6587
redmass: 4.4110 3.8542 3.3895 4.2355 3.8104 2.2480 2.8920 5.9604 1.6082 4.6975 5.0317 1.8523 2.8660 7.0262 3.6385 6.3078 2.1926 5.6980 4.5967 2.7545 3.1254 5.5233 1.2728 5.0852 1.6016 1.7114 4.7806 3.2444 1.4101 5.7748 1.4350 1.3764 1.3858 1.3743 3.4937 2.0762 2.2410 1.8821 3.2683 1.2224 1.2621 1.6408 1.2704 1.7238 1.8106 2.5339 3.2239 4.6196 1.8914 6.0000 3.0965 2.7811 5.4242 5.4308 5.2931 6.6170 7.0059 7.0963 1.0966 1.0844 1.0858 1.0864 1.0916 1.0973 1.0942 1.0991 1.0958 1.0481 1.0976
irintensity: 1.2595 5.4542 23.0754 9.2132 2.3624 10.0294 11.0251 1.3971 258.3944 5.2869 0.2929 20.0536 0.7896 0.8877 0.1538 0.5287 1.0089 2.8530 4.2745 1.4282 15.2414 6.0781 1.0625 14.0029 86.7861 32.0770 2.0840 68.6771 0.2079 31.7056 0.0127 1.2351 2.0185 2.9793 7.2496 1.5650 12.4002 71.3674 93.5178 0.3040 22.7066 19.3688 9.2345 0.7550 2.1962 4.0769 19.3364 3.4529 4.3505 23.1764 22.6555 5.9231 170.6083 113.2120 0.0343 2.2594 7.1060 3.7764 53.1741 1.4275 1.6349 3.1938 10.2196 45.8269 29.3458 44.2221 11.7461 55.5550 87.8230
temp: 298.150 k
press: 1.00000 atm
elementType: 7 7 6 6 6 6 6 6 6 6 6 6 6 6 6 1 1 1 1 1 1 1 1 1 1
symmnumber: 1
zpe: 512460.5 jmol-1
zpe.correction: 0.195186 hartree
zpe.thermalcorrener: 0.206378 hartree
zpe.thermalcorrenthalpy: 0.207322 hartree
zpe.thermalcorrgfe: 0.158589 hartree
zpe.sumelectzpe: -609.859750 hartree
zpe.sumelectthermal: -609.848559 hartree
zpe.sumelectthermalent: -609.847614 hartree
zpe.sumelectthermalfe: -609.896347 hartree
dipole: -1.9148 -1.6982 0.0013
dipole: 2.5593
quadrupole: -61.5938 -75.3815 -94.2655
quadrupole: 5.3092 0.0027 0.0003
quadrupole: 15.4865 1.6987 -17.1852 5.3092 0.0027 0.0003
hfenergy: -610.0549361 hartree
pointgroup: C01 [X(C13H10N2)]
dipole: -0.7786283 -0.6379603 -0.0251707 debye
dipolederiv: 1.860815 -0.053391 0.038508 0.7587204 -0.3037447 0.0124111 0.0490937 -0.0040327 -0.1064813 -1.8333049 0.0315463 -0.0225587 -1.0132404 0.0715437 -0.0093319 -0.0355566 0.0117493 -0.6917859 -0.1193221 -0.143592 -0.0030109 0.0442446 -0.0254555 0.0017355 -0.0001667 -0.002279 -0.0822018 0.3336923 0.1761793 0.0085396 0.0646806 -0.02359 0.0002408 0.007085 0.0028496 0.0483975 0.0901436 0.0083172 0.0000725 0.0016343 -0.0669043 -0.0023824 -0.0001141 -0.0021867 0.088589 -0.1687455 -0.0581691 -0.0063687 -0.1725419 0.1050693 -0.0034115 -0.0082198 -0.0010926 0.1018394 -0.6155083 -0.074358 -0.012979 0.5586301 0.1417844 0.0133599 -0.0041809 0.0006889 -0.0064553 0.134209 0.0814582 0.0072876 0.1451746 0.1486017 0.0077991 0.007983 0.0064819 -0.1724018 0.0344358 -0.0513832 0.0032009 -0.2421097 -0.1678288 -0.0048891 0.0001847 -0.0012423 -0.1664454 -0.1792692 0.0442393 0.0011732 0.1397207 0.0922461 0.0074872 0.0029112 0.0055736 -0.2041511 0.0343005 0.0786552 0.0062648 0.0618417 -0.0724831 0.0034946 0.0061039 0.0040159 -0.2115017 -0.0189596 0.0344025 0.0041515 0.0951458 -0.006966 0.0049854 0.0052351 0.0037714 -0.194433 -0.1030841 0.0206815 0.0007939 -0.1618648 0.0648143 -0.0002021 -0.0010774 0.0034213 -0.1323674 0.0639731 0.0334566 0.0047293 0.0980923 0.1877512 0.0073919 0.0057602 0.0059856 -0.1475583 0.2287518 -0.0211856 0.0073782 -0.132743 -0.0541114 -0.0010339 0.0054667 0.0011375 -0.1569425 0.0625201 0.0404236 -0.0009405 -0.0372039 -0.1312422 -0.0049185 -0.0021695 -0.00339 0.1422737 -0.0151753 0.087237 -0.0019134 0.0220303 0.0717914 -0.0008483 -0.0029646 0.0005799 0.1522825 0.0881995 -0.0327239 -0.0019292 0.0147179 -0.1287659 -0.0042744 -0.0011319 -0.0051633 0.1599915 -0.0775173 -0.1174196 -0.0066922 -0.0456661 0.0323303 -0.0029842 -0.005602 -0.0045143 0.1601928 -0.0579096 -0.0510133 -0.0051385 -0.129826 0.0226199 -0.0047718 -0.006435 -0.0032043 0.1567003 -0.1027123 -0.1335758 -0.0071954 -0.036 0.0103717 -0.0029173 -0.0057335 -0.0049004 0.1570489 0.0916993 0.0064958 -0.0011637 -0.0189268 -0.1572174 -0.0053779 -0.0015398 -0.0048724 0.1550299 -0.113095 0.1010383 -0.0038648 0.1165178 0.034173 0.0003035 -0.0036814 0.0000292 0.1610055 0.1082999 -0.0062944 -0.0058789 0.0189921 -0.0085431 -0.005583 -0.006232 -0.0061483 0.396302 0.2735633 -0.0010249 -0.0024655 -0.1500205 0.1637553 -0.0062825 -0.0050181 -0.003258 0.3930724 unknown
polarizability: 291.7807782|-6.5644084|185.8734185|4.5774804|1.876485|58.3192049 unknown
InChI: InChI=1S/C13H10N2/c14-15-12-8-7-10-4-1-3-9-5-2-6-11(12)13(9)10/h1-8H,14H2
charge 0 multiplicity 1
25 atoms
N  -3.089335 0.611613 -0.081213
N  -4.296515 -0.018777 -0.114167
C  0.57554 -0.037021 -0.016452
C  -0.680111 0.672029 -0.030455
C  0.61293 -1.481745 -0.038335
C  1.819849 0.699406 0.020147
C  -1.946762 -0.099886 -0.068341
C  -0.647416 -2.209019 -0.074182
C  -0.666583 2.083757 -0.007387
C  1.85227 -2.153678 -0.024465
C  1.784819 2.128964 0.042361
C  3.060787 -0.026553 0.033424
C  -1.860014 -1.557838 -0.087978
C  0.556054 2.803088 0.028553
C  3.074746 -1.424182 0.011317
H  -0.608769 -3.305196 -0.090159
H  -1.623566 2.612956 -0.018204
H  1.870323 -3.249784 -0.041405
H  2.72836 2.686322 0.070483
H  4.000556 0.537582 0.061454
H  -2.774663 -2.162866 -0.115178
H  0.532899 3.898422 0.045606
H  4.027582 -1.96444 0.021769
H  -4.429135 -1.033909 -0.131969
H  -5.106647 0.592157 -0.122123
