program: Gaussian 09
title: 000248821
version: EM64L-G09RevD.01
frameworkgroup: C1[X(C14H13ClN4)]
method: RPBEPBE
basis: SDD
operation: Freq
keyword: #p
keyword: freq=noraman
keyword: PBEPBE/SDD
title: #p freq=noraman PBEPBE/SDD
converged: YES YES NO NO
title: Mulliken charges:
elementType: Cl N N N N C C C C C C C C C C C C C C H H H H H H H H H H H H H
charge: -0.069010 -0.164363 -0.162167 -0.624307 -0.625384 0.336114 -0.041668 0.318309 -0.371977 -0.389980 -0.384291 -0.344628 -0.219623 -0.216154 -0.235187 -0.251280 -0.113024 -0.242021 0.268470 0.262714 0.256170 0.255403 0.259636 0.253029 0.250534 0.225422 0.222630 0.226453 0.311633 0.339406 0.363868 0.305271
chargesum: 0.00000
title: Mulliken charges with hydrogens summed into heavy atoms:
elementType: Cl N N N N C C C C C C C C C C C C C C
charge: -0.069010 -0.164363 -0.162167 0.026732 0.043755 0.336114 -0.041668 0.318309 -0.109262 -0.133810 -0.128888 -0.084992 0.033405 0.034380 -0.009764 -0.028650 -0.113024 -0.015568 0.268470
polarizability: 3.08853879e+02 -2.24418519e+01 2.51359283e+02 -1.04714913e+01 -4.53335930e+00 1.00889893e+02
1716.lowfreq: -6.8398 -4.1798 0.0019 0.0023 0.0028 0.1533 30.4310 45.1658 50.3409
frequency: 30.4125 45.1587 50.3341 58.8315 70.7631 82.6240 125.2373 179.6676 182.7598 198.0807 230.7978 243.6387 265.6618 285.0509 338.6271 388.0772 401.3374 406.5740 413.6905 420.5768 458.7910 468.1251 503.0394 523.7588 528.6652 612.5266 620.6912 628.3212 643.9658 649.9853 688.7405 698.7985 715.1348 721.5455 752.3896 785.1349 829.2979 838.1920 848.8623 890.5208 922.5797 956.1022 965.3702 969.4245 975.1307 989.3698 992.4407 998.2910 1006.0628 1028.1372 1050.7685 1071.2530 1082.8209 1105.1537 1115.5419 1171.6929 1180.6728 1186.9829 1194.7788 1290.6708 1297.4667 1328.6759 1358.6660 1375.3556 1392.9478 1429.8528 1470.8698 1472.9716 1491.1479 1495.7726 1549.1330 1573.6071 1582.1874 1582.8357 1594.5917 1606.7461 1623.0173 3120.4106 3130.1568 3143.5224 3149.2172 3151.2340 3158.4902 3169.3355 3173.3389 3182.3957 3471.9636 3554.3884 3672.4653 3707.5059
redmass: 4.0772 7.7149 4.5320 5.4743 4.5886 4.4103 6.3003 1.9358 4.7176 2.4940 7.9552 4.2295 4.6095 4.8730 4.7585 3.7576 2.8270 2.1288 2.9182 2.0609 3.9243 3.3035 3.0432 1.3152 3.8432 6.1798 5.9856 4.6823 2.7507 4.1930 5.6796 1.6899 2.2300 2.3926 3.7351 2.6972 1.2469 1.6156 1.2606 5.1102 1.5216 1.5118 2.9899 1.4199 1.3778 5.5750 1.3475 3.8478 1.8943 2.1790 2.1493 2.7029 1.6489 1.5513 2.1956 1.0538 1.2018 3.2212 1.1218 1.3064 2.6640 1.5372 5.1099 7.1151 4.3297 2.3216 2.6835 2.5159 3.6483 2.1091 3.2559 7.0870 5.1494 2.0978 5.1190 5.8177 1.4634 1.0845 1.0886 1.0940 1.0883 1.0879 1.0995 1.0962 1.0973 1.0955 1.0494 1.0451 1.0984 1.1045
irintensity: 0.4593 0.5683 3.7614 0.8866 0.3747 2.5858 7.5477 36.6725 3.7926 33.1531 4.0683 16.5736 2.3128 7.9412 1.5278 64.9672 0.8414 159.6549 4.9744 160.4219 23.0566 24.0545 28.7867 51.2589 17.0058 0.6539 3.6604 4.9143 52.4127 2.4872 10.3769 43.5551 52.4467 98.8275 11.9749 23.2914 1.3526 55.7559 3.1910 49.0611 6.0996 7.3864 39.1286 5.7893 0.0334 0.2714 0.5951 38.3093 1.1404 10.7964 7.2451 41.6945 14.8921 37.7261 60.8877 0.2855 3.4781 30.7539 3.1573 1.3473 33.0908 12.8065 14.1303 1.5803 15.5576 32.9492 368.1601 25.3792 178.6603 16.3007 294.7478 10.1787 16.0529 431.3649 60.9274 1.0316 588.5891 1.2114 7.4528 40.8665 2.0917 2.5508 34.4671 11.3645 1.3861 5.7063 33.4978 98.4357 80.0440 38.9598
temp: 298.150 k
press: 1.00000 atm
elementType: 17 7 7 7 7 6 6 6 6 6 6 6 6 6 6 6 6 6 6 1 1 1 1 1 1 1 1 1 1 1 1 1
symmnumber: 1
zpe: 640527.9 jmol-1
zpe.correction: 0.243964 hartree
zpe.thermalcorrener: 0.261416 hartree
zpe.thermalcorrenthalpy: 0.262360 hartree
zpe.thermalcorrgfe: 0.197084 hartree
zpe.sumelectzpe: -1219.005194 hartree
zpe.sumelectthermal: -1218.987743 hartree
zpe.sumelectthermalent: -1218.986799 hartree
zpe.sumelectthermalfe: -1219.052075 hartree
dipole: 5.0659 -3.4213 -0.1679
dipole: 6.1153
quadrupole: -108.9287 -85.9029 -120.3824
quadrupole: -16.2436 -3.9232 -1.1446
quadrupole: -3.8573 19.1684 -15.3111 -16.2436 -3.9232 -1.1446
hfenergy: -1219.2491586 hartree
pointgroup: C01 [X(C14H13Cl1N4)]
dipole: 1.9747119 -1.339246 -0.3089496 debye
polarizability: 305.8673382|-21.1738244|251.2794691|-27.4082208|7.6313235|103.956248 unknown
InChI: InChI=1S/C14H13ClN4/c15-12-8-6-11(7-9-12)13(18-19-14(16)17)10-4-2-1-3-5-10/h1-9H,16-17H2
charge 0 multiplicity 1
32 atoms
Cl -5.84685 -0.460249 0.326075
N  0.875967 -1.382171 -0.137267
N  2.282058 -1.424569 -0.176382
N  4.065246 -2.918462 -0.306042
N  1.858064 -3.750919 -0.615766
C  -1.200672 -0.23875 0.093743
C  0.288053 -0.193827 -0.009135
C  0.987835 1.128042 0.050296
C  -2.00867 0.837945 -0.368565
C  -1.854625 -1.384412 0.630968
C  0.553332 2.116339 0.978803
C  2.089656 1.435512 -0.795704
C  -3.41779 0.776562 -0.306103
C  -3.259822 -1.460533 0.703804
C  1.196845 3.369916 1.060523
C  2.720182 2.695748 -0.726327
C  -4.0238 -0.374648 0.230598
C  2.281413 3.667903 0.203455
C  2.703612 -2.694673 -0.364635
H  -1.534464 1.726753 -0.796374
H  -1.240472 -2.210996 1.000332
H  -0.284907 1.893369 1.648381
H  2.445176 0.680501 -1.500491
H  -4.029632 1.605305 -0.674155
H  -3.753118 -2.339992 1.12837
H  0.852232 4.11154 1.79015
H  3.559712 2.918802 -1.394834
H  2.778463 4.64313 0.259782
H  4.49235 -3.775557 -0.644012
H  4.647332 -2.110917 -0.094489
H  0.867499 -3.489255 -0.61036
H  2.150297 -4.723036 -0.596539
