program: Gaussian 09
title: 000248827
version: EM64L-G09RevD.01
frameworkgroup: C1[X(C10H11ClO4)]
method: RPBEPBE
basis: SDD
operation: Freq
keyword: #p
keyword: freq=noraman
keyword: PBEPBE/SDD
title: #p freq=noraman PBEPBE/SDD
converged: YES YES NO NO
title: Mulliken charges:
elementType: Cl O O O O C C C C C C C C C C H H H H H H H H H H H
charge: -0.051730 -0.247498 -0.243945 -0.439437 -0.232202 0.400850 -0.428181 -0.302437 -0.314042 -0.350270 -0.367576 0.250998 -0.219673 -0.176754 -0.125735 0.273165 0.239834 0.251316 0.232682 0.215551 0.229084 0.254932 0.261101 0.263093 0.259025 0.367849
chargesum: 0.00000
title: Mulliken charges with hydrogens summed into heavy atoms:
elementType: Cl O O O O C C C C C C C C C C
charge: -0.051730 -0.247498 -0.243945 -0.071588 -0.232202 0.400850 0.084818 0.181560 0.130594 -0.095338 -0.106475 0.250998 0.043420 0.082271 -0.125735
polarizability: 1.67795073e+02 1.88166723e+01 1.16254210e+02 -1.23849828e+01 1.16029166e+01 9.91417675e+01
1716.lowfreq: -7.1227 -1.1886 -0.0018 -0.0017 -0.0016 8.7139 29.6565 34.4824 61.2044
frequency: 29.5675 34.4520 61.1963 63.6017 83.6603 115.9505 142.2328 192.7275 201.3717 246.6396 279.1642 316.6110 333.0105 355.7704 398.4181 413.9264 427.4897 475.0716 502.1040 549.5652 558.7547 604.7439 622.5796 642.2449 695.9294 753.4202 774.8859 811.6880 825.8555 852.5807 889.3475 931.6805 955.1612 967.1147 989.6385 1002.2349 1014.1130 1042.2103 1072.7593 1086.3067 1109.0459 1172.4456 1185.0707 1188.0360 1222.1530 1240.5734 1246.2557 1288.5282 1334.9235 1341.9749 1356.3312 1372.0228 1375.0648 1401.2588 1432.9759 1445.3167 1462.7998 1471.8794 1583.5463 1602.3693 1629.7028 2974.3090 2996.8431 3035.3447 3073.9015 3083.5881 3129.7967 3151.0199 3161.8684 3175.1028 3181.5921 3524.6678
redmass: 6.9898 7.8623 5.7347 4.4746 7.3161 7.0008 3.1715 4.1851 5.3336 6.2759 4.0929 5.4270 7.4313 2.5786 5.3655 2.9013 1.2611 2.4818 2.7629 5.5391 3.5151 6.8607 6.0245 4.5398 3.7259 5.0248 5.3680 1.2600 1.5340 3.2394 2.6213 1.3267 1.3542 2.6019 3.7096 2.4097 5.3084 3.6680 2.5909 1.9119 1.3144 1.3366 2.3994 1.3153 3.4592 1.1720 1.2625 1.2568 1.2086 1.2736 1.3066 4.2099 1.3197 3.8308 1.1042 1.0792 1.0838 2.3993 7.3613 6.8239 10.1652 1.0670 1.0643 1.0605 1.0960 1.0972 1.1062 1.0882 1.0888 1.0960 1.0977 1.0663
irintensity: 0.1456 0.0196 1.6708 2.5814 0.1104 0.6246 3.0677 2.4487 7.0605 4.4137 7.9401 1.3178 1.2487 25.6418 7.3944 4.4980 110.3278 0.9430 13.5092 6.1390 1.1873 47.0406 5.0699 13.7269 0.0037 19.5108 1.5225 13.8135 82.5812 16.0015 23.9188 1.8731 0.3585 57.9530 28.4542 2.8486 53.7751 61.6428 38.0063 8.0169 12.6925 54.6874 90.0282 57.8171 196.5751 35.8955 61.4368 0.7319 2.3865 4.6504 3.1430 0.5860 26.4042 0.3874 21.5553 10.3898 9.2290 201.4265 7.3881 15.6431 189.8642 39.4200 25.8043 20.5160 36.4983 4.8136 7.3103 10.7990 1.6799 3.2396 1.4530 58.9252
temp: 298.150 k
press: 1.00000 atm
elementType: 17 8 8 8 8 6 6 6 6 6 6 6 6 6 6 1 1 1 1 1 1 1 1 1 1 1
symmnumber: 1
zpe: 510004.5 jmol-1
zpe.correction: 0.194250 hartree
zpe.thermalcorrener: 0.209061 hartree
zpe.thermalcorrenthalpy: 0.210005 hartree
zpe.thermalcorrgfe: 0.150314 hartree
zpe.sumelectzpe: -1147.464412 hartree
zpe.sumelectthermal: -1147.449601 hartree
zpe.sumelectthermalent: -1147.448657 hartree
zpe.sumelectthermalfe: -1147.508348 hartree
dipole: -1.9586 -1.5809 -0.0379
dipole: 2.5173
quadrupole: -99.8574 -95.8448 -92.5911
quadrupole: -5.9105 2.1911 1.8283
quadrupole: -3.7597 0.2530 3.5067 -5.9105 2.1911 1.8283
hfenergy: -1147.6586621 hartree
pointgroup: C01 [X(C10H11Cl1O4)]
dipole: -0.3523635 -0.8953009 -0.2347446 debye
dipolederiv: -0.3002404 -0.3222897 -0.0633103 -0.3716813 -0.5694929 -0.1234255 -0.0921003 -0.1473698 -0.1532036 -0.8907465 -0.5855426 0.0495094 -0.7599195 -1.1911185 -0.0117732 -0.0112306 -0.1103362 -0.2852314 -0.7263244 0.3300484 0.014133 0.4283683 -1.104519 0.1791209 -0.0461967 0.2680705 -0.4495173 -0.6230129 -0.2748998 -0.006982 -0.204362 -0.4294917 0.0308331 -0.0381727 0.0584081 -0.520551 -0.6672164 -0.2667397 0.2473452 0.0954646 -0.6642972 0.1364982 0.1962921 0.4354242 -0.5748926 0.5938217 0.5565948 0.0890788 0.7259475 1.0001349 0.1192822 0.2761922 0.3316081 0.0540874 0.4935834 0.3329394 -0.0373279 0.417069 0.422399 -0.1296626 -0.2432441 -0.341169 0.2798275 0.4868154 -0.3080948 -0.0014436 -0.2790011 0.3668668 0.0594442 -0.1018915 0.0409638 0.1894945 0.4299588 0.2499529 -0.116719 0.1911955 0.3665272 -0.1051072 -0.0174136 -0.0747371 0.2969315 -0.2598949 0.0243924 0.0286285 -0.0241073 -0.2296328 0.0398599 -0.2140569 -0.1860518 -0.0575342 -0.229565 -0.0810955 -0.0663057 -0.0749507 -0.2371732 -0.0250438 0.0328701 0.12663 0.0713277 0.8581555 -0.0124576 -0.2745554 -0.4448708 1.2499498 -0.4057666 -0.159528 -0.7088588 0.6475873 -0.0975285 -0.0333148 -0.0931598 0.024254 -0.1451726 -0.1062145 -0.0076402 0.01484 0.0371486 -0.0932805 -0.0060185 -0.0401669 -0.0261151 -0.110858 -0.0036299 -0.0620234 -0.0435422 0.0659679 0.2767224 0.5286772 0.1321962 0.5788082 0.7428642 0.2399475 0.135794 0.2166507 0.0149964 0.0347487 -0.0787004 0.0073016 -0.070083 0.0041684 -0.0264833 0.0162936 -0.0697571 0.0731806 -0.0372504 0.0128363 -0.0395465 -0.0167822 0.0888513 0.0160528 0.0077176 0.1542479 -0.0517298 0.0576237 0.0625523 -0.0017166 0.0816666 0.0327429 0.0468556 -0.0532462 0.0309857 -0.0375402 -0.0495756 -0.0124341 0.0223748 -0.1141771 -0.0224704 0.0063858 0.0775627 -0.0172683 0.0855241 0.0175259 0.0026369 -0.0827017 -0.0250615 -0.0576189 0.1351798 -0.0533463 0.0885604 -0.0641125 -0.0793089 0.0340606 0.0777378 0.1085157 0.003578 -0.0435159 0.0652362 -0.0368324 0.0859174 0.098932 -0.0939866 0.0698098 -0.108709 0.043029 0.0524738 0.108443 0.0526371 0.0219203 0.1451358 -0.0405426 -0.0040339 -0.0388244 0.093074 -0.0614803 0.0081124 -0.0569054 -0.0112675 0.1452937 -0.0284927 0.011665 -0.0362897 0.0972455 -0.0456254 0.0087369 -0.0464363 -0.0079784 0.0977913 -0.0650372 0.0632456 -0.0746279 0.080577 0.0478734 0.0596761 0.0387288 0.0415293 0.3178361 0.0749554 0.0149434 0.018273 0.1698372 -0.0220789 0.1071638 -0.0184908 0.2481177 unknown
polarizability: 126.6783775|38.2139922|144.4030052|-12.2901157|6.8027223|112.1096683 unknown
InChI: InChI=1S/C10H11ClO4/c11-8-1-3-9(4-2-8)15-7-10(13)14-6-5-12/h1-4,12H,5-7H2
charge 0 multiplicity 1
26 atoms
Cl 3.109637 3.111802 0.397902
O  0.051815 -1.827026 -1.224628
O  -2.32182 -0.774781 -0.427318
O  -2.114204 1.925581 0.791369
O  -2.716551 -2.457867 1.145925
C  0.728401 -0.686358 -0.755727
C  -0.734338 -2.608069 -0.282666
C  -3.512296 -0.003387 0.062951
C  -3.083744 0.91626 1.211758
C  0.71481 -0.228806 0.585611
C  1.465988 0.013937 -1.741286
C  -2.021803 -1.950004 0.236418
C  1.443702 0.934322 0.935693
C  2.192095 1.168987 -1.392947
C  2.17236 1.616227 -0.05464
H  -1.021561 -3.516188 -0.839151
H  -0.137693 -2.922794 0.596462
H  -3.821211 0.576737 -0.81943
H  -4.299519 -0.710343 0.380803
H  -2.705911 0.30789 2.059792
H  -3.963454 1.485079 1.559519
H  0.168473 -0.760235 1.371077
H  1.457101 -0.356962 -2.769971
H  1.438069 1.295638 1.96791
H  2.762111 1.713528 -2.151071
H  -1.300057 1.473535 0.446047
