program: Gaussian 09
title: 000248801
version: EM64L-G09RevD.01
frameworkgroup: C1[X(C17H18N2O)]
method: RPBEPBE
basis: SDD
operation: Freq
keyword: #p
keyword: freq=noraman
keyword: PBEPBE/SDD
title: #p freq=noraman PBEPBE/SDD
converged: YES YES NO NO
title: Mulliken charges:
elementType: O N N C C C C C C C C C C C C C C C C C H H H H H H H H H H H H H H H H H H
charge: -0.467991 -0.106184 -0.003309 -0.048035 -0.087282 0.377086 0.473719 -0.361053 -0.372423 -0.403612 -0.405751 -0.656521 -0.626405 -0.245453 -0.228349 -0.246286 -0.250222 -0.224856 -0.238063 -0.244693 0.249332 0.369341 0.269439 0.228243 0.232200 0.275509 0.282184 0.212804 0.217075 0.228824 0.215017 0.219961 0.228817 0.223934 0.228996 0.225030 0.231910 0.227066
chargesum: 0.00000
title: Mulliken charges with hydrogens summed into heavy atoms:
elementType: O N N C C C C C C C C C C C C C C C C C
charge: -0.098650 -0.106184 -0.003309 -0.048035 0.162049 0.377086 0.473719 -0.091614 -0.144179 -0.171413 -0.130242 0.055542 0.037397 -0.245453 0.000469 -0.022353 -0.021226 0.000174 -0.006152 -0.017627
polarizability: 2.16032731e+02 1.75718713e+01 1.91111743e+02 1.04946474e+01 3.74544911e+00 1.62200607e+02
1716.lowfreq: -6.6580 -0.0007 0.0001 0.0004 4.1186 9.0687 27.6284 34.5273 52.7709
frequency: 27.3829 34.5150 52.7176 58.2792 65.2647 78.9574 113.9388 118.6296 168.1577 200.9377 208.2096 222.6095 232.4843 256.2725 277.5368 284.6169 316.3266 325.0807 344.4894 376.3155 395.3897 401.0924 403.7741 423.6289 443.5620 503.0416 548.5717 578.8769 615.4366 616.5157 630.9040 663.6036 702.3104 704.8301 753.3243 763.3058 795.2950 811.7653 850.8393 853.0780 856.8994 905.6855 920.3199 937.4398 954.4044 977.6659 978.9129 989.5572 990.4764 997.5296 998.7680 1012.7599 1028.9526 1030.9238 1040.5717 1065.9653 1084.9827 1092.4436 1102.8922 1145.7916 1156.6826 1170.7297 1172.7115 1176.3275 1190.0851 1196.0624 1202.4014 1238.1788 1270.4756 1304.5820 1322.3400 1330.4832 1358.3034 1379.8408 1383.8167 1425.5229 1433.9198 1436.4903 1446.2380 1459.5006 1471.3362 1482.0279 1482.9611 1484.3670 1495.9377 1590.5794 1594.3594 1609.6679 1614.1952 2146.7639 2888.4175 2898.3904 3012.3922 3025.5669 3043.2955 3082.1817 3114.6505 3125.8653 3126.1582 3126.5133 3134.0837 3139.7888 3146.3086 3155.2661 3158.0992 3167.7303 3175.7019 3543.4562
redmass: 3.6472 3.8411 4.3740 4.6382 3.7722 4.7488 5.5362 4.2862 2.7469 1.3543 4.1163 1.2341 3.3938 4.7423 3.9680 4.7867 4.1213 3.2665 2.7327 1.5947 6.6516 2.8051 2.5719 2.5677 4.4713 3.9334 4.0194 5.7106 6.3853 6.4274 5.6959 6.0917 1.8469 1.6744 1.9927 2.1108 3.8817 4.7835 1.3282 1.2749 3.7983 2.1505 1.6216 2.0934 3.2106 1.3990 1.3979 5.7588 5.9431 1.3354 1.3235 3.9419 2.1704 2.2521 1.6859 2.2126 1.5899 1.2615 1.9082 1.4559 1.8955 1.6028 1.1171 1.3109 1.1875 1.6467 1.4682 1.4937 2.5782 1.5992 1.3443 1.4545 1.3746 6.7625 8.7454 1.1413 2.2026 2.2306 1.1540 1.0450 1.0570 2.2341 1.8763 1.1388 1.0537 5.8781 6.3485 5.9935 6.0721 12.5499 1.0532 1.0546 1.0818 1.0778 1.0796 1.1006 1.0866 1.0968 1.0880 1.0846 1.0877 1.0933 1.0922 1.0958 1.0985 1.1014 1.0958 1.0657
irintensity: 0.1943 0.3080 1.2235 0.0533 0.7929 2.3287 0.8785 1.2007 3.0590 0.6873 0.4813 0.8670 4.1497 1.7655 3.3856 3.6889 1.0142 25.1489 28.6137 136.5569 1.0191 4.0640 16.4258 4.8752 4.9167 1.8617 2.9393 16.7893 0.3287 0.0285 25.3654 22.2568 47.6334 58.5960 76.9503 52.7198 3.2939 12.1186 3.0138 0.2664 15.7394 10.0877 7.7914 0.9855 31.5600 0.9418 0.1806 1.2721 0.6506 1.2427 0.0656 40.3053 9.1957 2.1568 27.8054 48.4900 0.9357 5.6104 7.4829 3.6578 32.7211 4.0475 1.8957 1.8633 2.0962 10.2290 4.7062 10.1429 4.2724 9.4156 0.6478 32.5665 8.3576 0.4053 2.2008 10.0500 5.9311 25.0922 4.8755 10.4170 14.5530 20.4644 12.8659 9.8168 15.7871 1.5410 0.4107 4.0087 3.1539 7.3616 62.2993 128.4057 8.5347 30.0807 34.7469 29.1034 8.5092 3.6773 1.5699 1.9861 3.7022 31.0193 27.9257 24.7159 30.2737 16.6666 7.5484 11.9237
temp: 298.150 k
press: 1.00000 atm
elementType: 8 7 7 6 6 6 6 6 6 6 6 6 6 6 6 6 6 6 6 6 1 1 1 1 1 1 1 1 1 1 1 1 1 1 1 1 1 1
symmnumber: 1
zpe: 804043.4 jmol-1
zpe.correction: 0.306244 hartree
zpe.thermalcorrener: 0.325435 hartree
zpe.thermalcorrenthalpy: 0.326379 hartree
zpe.thermalcorrgfe: 0.258003 hartree
zpe.sumelectzpe: -841.847137 hartree
zpe.sumelectthermal: -841.827946 hartree
zpe.sumelectthermalent: -841.827001 hartree
zpe.sumelectthermalfe: -841.895378 hartree
dipole: -0.4204 -2.1036 1.6622
dipole: 2.7138
quadrupole: -106.9199 -129.4762 -110.0884
quadrupole: -5.4184 1.3600 4.9241
quadrupole: 8.5749 -13.9813 5.4064 -5.4184 1.3600 4.9241
hfenergy: -842.1533806 hartree
pointgroup: C01 [X(C17H18N2O1)]
dipole: -0.4842632 -0.7005561 0.6439804 debye
polarizability: 221.6394852|6.8770063|182.9606937|16.3489096|-0.1219433|164.7449023 unknown
InChI: InChI=1S/C17H18N2O/c1-19(2)16(13-18)17(20,14-9-5-3-6-10-14)15-11-7-4-8-12-15/h3-12,16,20H,1-2H3
charge 0 multiplicity 1
38 atoms
O  0.246048 0.473712 -1.932012
N  -1.408174 2.215863 0.085098
N  1.775816 3.442823 -0.456081
C  0.151283 0.244009 -0.474236
C  -0.074605 1.624629 0.269382
C  1.445817 -0.466819 -0.010604
C  -1.074961 -0.655083 -0.241974
C  1.86573 -1.590202 -0.773075
C  -1.327936 -1.164316 1.055782
C  2.215902 -0.087712 1.116561
C  -1.951944 -0.98951 -1.29902
C  -1.735305 2.729805 -1.26364
C  -1.775515 3.162227 1.159389
C  1.017009 2.588825 -0.103002
C  3.022646 -2.313072 -0.420471
C  -2.451188 -1.982436 1.298071
C  3.378762 -0.811791 1.470619
C  -3.073873 -1.814791 -1.057643
C  3.786417 -1.9261 0.706668
C  -3.331886 -2.309916 0.240292
H  0.022303 1.413851 1.351113
H  1.114052 0.917441 -2.117708
H  1.269661 -1.891402 -1.640822
H  -0.635619 -0.941727 1.877395
H  1.942862 0.778587 1.728292
H  -1.743412 -0.610211 -2.302765
H  -1.493188 1.971577 -2.021067
H  -1.185393 3.668631 -1.513534
H  -2.818529 2.94053 -1.30237
H  -2.839401 3.434107 1.044595
H  -1.176739 4.104864 1.14667
H  -1.652864 2.68155 2.14678
H  3.327879 -3.17853 -1.019157
H  -2.634758 -2.371334 2.306065
H  3.965403 -0.498346 2.341248
H  -3.746077 -2.070602 -1.884728
H  4.687124 -2.485084 0.983543
H  -4.202748 -2.948944 0.425345
