program: Gaussian 09
title: 000248778
version: EM64L-G09RevD.01
frameworkgroup: C1[X(C16H14O3)]
method: RPBEPBE
basis: SDD
operation: Freq
keyword: #pfreq=noraman
keyword: PBEPBE/SDD
title: #p freq=noraman PBEPBE/SDD
converged: NO YES NO NO
title: Mulliken charges:
elementType: O O O C C C C C C C C C C C C C C C C H H H H H H H H H H H H H H
charge: -0.268510 -0.215558 -0.263615 -0.279658 -0.245583 0.491507 0.156676 -0.349251 -0.417712 0.302131 -0.358573 -0.357886 0.321895 -0.337791 -0.343554 -0.244189 -0.228248 -0.222479 -0.537527 0.271951 0.232459 0.261255 0.235678 0.251621 0.241989 0.229139 0.278088 0.233399 0.235305 0.235493 0.246976 0.222898 0.221675
chargesum: 0.00000
title: Mulliken charges with hydrogens summed into heavy atoms:
elementType: O O O C C C C C C C C C C C C C C C C
charge: -0.268510 -0.215558 -0.263615 -0.007707 -0.013124 0.491507 0.156676 -0.087997 -0.182033 0.302131 -0.106952 -0.115897 0.321895 -0.108652 -0.065466 -0.010790 0.007057 0.013014 0.154022
polarizability: 2.94115500e+02 1.64815782e+00 1.59031099e+02 -3.32017877e+00 2.37308981e+01 1.28795100e+02
1716.lowfreq: -10.6177 -4.4450 -0.0010 -0.0008 -0.0008 0.9637 15.4473 26.2412 38.8491
frequency: 15.1552 26.0766 38.7215 50.5918 92.2273 98.3141 132.6068 157.7026 167.4114 210.3777 224.6250 252.5699 289.2126 306.0992 373.2318 399.1933 408.4178 417.5232 428.0981 445.8598 476.8122 537.2136 553.8798 612.4970 626.9327 641.9924 672.9084 694.8622 723.4967 733.0290 755.9220 763.1096 807.7932 818.3262 825.5808 835.7615 855.5673 858.2372 937.8943 943.4638 968.0603 985.7563 988.2457 989.7033 992.2802 1002.0117 1010.3041 1026.6174 1055.4051 1088.2225 1093.5675 1110.3382 1112.2000 1155.6636 1172.2016 1174.4785 1174.8946 1194.3126 1225.1239 1235.4563 1240.0861 1294.6163 1310.9281 1328.4221 1370.7713 1386.9777 1394.8151 1423.9482 1435.6208 1436.8454 1467.3326 1472.4596 1479.5936 1504.9689 1554.5502 1581.3631 1591.5620 1609.4931 1624.4593 2959.7825 3048.0026 3099.1266 3121.2728 3125.8653 3127.4237 3130.6903 3140.7529 3140.8915 3151.7708 3160.5937 3163.2101 3169.2197 3170.8264
redmass: 4.8350 4.0246 4.4374 5.1292 5.9238 3.7858 4.8924 4.8652 5.5786 3.0900 1.8359 2.2938 5.8987 5.8856 6.0587 2.8498 4.2715 3.6302 4.1412 4.8425 4.6847 2.5786 5.0531 6.4292 7.1506 6.2372 5.8085 1.7370 4.0188 3.5995 6.4672 2.9262 1.9927 2.3156 3.8543 1.9976 1.3208 2.7038 1.3852 1.4627 1.3589 7.9069 4.6659 1.4944 4.0057 2.6532 1.3512 1.9181 1.3996 1.5217 1.2685 1.3430 1.2605 1.3303 1.4624 1.1244 1.8115 1.2373 2.1314 2.2125 1.9889 1.4739 1.4493 1.6370 2.8470 8.9103 3.2144 3.4468 1.9452 1.2955 1.0500 1.0691 2.2177 2.6790 8.1965 7.1491 6.4731 6.1370 6.3391 1.0330 1.1040 1.0898 1.0892 1.0923 1.0963 1.0854 1.0882 1.0885 1.0921 1.0959 1.0940 1.0962 1.1012
irintensity: 1.8513 0.1048 1.2988 0.6223 2.2065 4.4057 3.7314 0.9115 1.8802 3.2611 0.8064 1.7104 7.6870 5.7198 4.8947 0.2240 0.6671 0.5087 2.0249 0.7123 2.5674 20.7007 39.1573 0.5258 0.8604 16.0915 20.1624 58.9900 5.7632 26.0168 19.5977 20.8181 59.6912 19.6569 26.5942 23.3421 1.8255 5.8472 0.8778 4.0062 2.5732 43.4915 0.9097 2.8645 36.4037 22.2716 1.2563 1.7637 14.9973 12.3081 2.9802 15.4372 0.2931 2.3092 80.9706 11.2621 27.0889 17.6186 124.4017 175.7277 124.7857 9.2889 31.6172 10.2307 136.0322 3.5121 131.0831 0.6572 39.3359 3.8688 13.6790 48.8187 5.8272 81.5785 105.3983 10.5209 22.9184 24.9880 85.9426 74.0680 47.7786 1.7354 12.0911 31.7608 5.2869 0.9941 5.1224 2.5966 16.2369 24.5060 15.5785 5.3346 22.3628
temp: 298.150 k
press: 1.00000 atm
elementType: 8 8 8 6 6 6 6 6 6 6 6 6 6 6 6 6 6 6 6 1 1 1 1 1 1 1 1 1 1 1 1 1 1
symmnumber: 1
zpe: 670999.6 jmol-1
zpe.correction: 0.255570 hartree
zpe.thermalcorrener: 0.272362 hartree
zpe.thermalcorrenthalpy: 0.273306 hartree
zpe.thermalcorrgfe: 0.208181 hartree
zpe.sumelectzpe: -842.367558 hartree
zpe.sumelectthermal: -842.350766 hartree
zpe.sumelectthermalent: -842.349822 hartree
zpe.sumelectthermalfe: -842.414947 hartree
dipole: -0.7835 3.6592 -2.9700
dipole: 4.7775
quadrupole: -79.3397 -114.5943 -109.5083
quadrupole: 12.1215 7.7495 7.6039
quadrupole: 21.8077 -13.4468 -8.3609 12.1215 7.7495 7.6039
hfenergy: -842.623128 hartree
pointgroup: C01 [X(C16H14O3)]
dipole: -0.2780419 -1.8213804 -0.3717282 debye
polarizability: 294.1910924|-0.3252696|117.5902729|-0.3106793|10.1481934|170.160334 unknown
InChI: InChI=1S/C16H14O3/c1-18-13-9-7-12(8-10-13)15-16(19-15)14(17)11-5-3-2-4-6-11/h2-10,15-16H,1H3
charge 0 multiplicity 1
33 atoms
O  0.139702 2.077219 0.044628
O  2.206463 1.06004 1.947822
O  -5.571435 -1.033278 -0.821255
C  -0.478881 0.973742 0.86473
C  0.774827 0.705899 0.049012
C  -1.813993 0.463108 0.444972
C  2.092874 0.579745 0.77838
C  -2.2870 0.630553 -0.885802
C  -2.635193 -0.211973 1.37837
C  3.232537 -0.138414 0.120391
C  -3.537537 0.124233 -1.272035
C  -3.894758 -0.730867 1.004414
C  -4.345139 -0.56493 -0.329121
C  3.237716 -0.49826 -1.255581
C  4.369874 -0.448246 0.918981
C  4.355645 -1.152631 -1.816978
C  5.479433 -1.108299 0.359773
C  5.475097 -1.464571 -1.011904
C  -6.449926 -1.747149 0.10931
H  -0.295714 1.10271 1.940403
H  0.642429 0.168948 -0.896809
H  -1.677001 1.195341 -1.599618
H  -2.290627 -0.336966 2.412241
H  -3.918773 0.25449 -2.289392
H  -4.507433 -1.247318 1.749076
H  2.389911 -0.254061 -1.903667
H  4.352572 -0.153689 1.973632
H  4.353573 -1.417497 -2.879754
H  6.347282 -1.345764 0.984536
H  6.339433 -1.977127 -1.448719
H  -7.335611 -2.018399 -0.483397
H  -6.751226 -1.099022 0.955273
H  -5.965423 -2.664165 0.497987
