program: Gaussian 09
title: 000248769
version: EM64L-G09RevD.01
frameworkgroup: C1[X(C11H18N2O3)]
method: RPBEPBE
basis: SDD
operation: Freq
keyword: #p
keyword: freq=noraman
keyword: PBEPBE/SDD
title: #p freq=noraman PBEPBE/SDD
converged: YES YES NO NO
title: Mulliken charges:
elementType: O O O N N C C C C C C C C C C C H H H H H H H H H H H H H H H H H H
charge: -0.412991 -0.289561 -0.241184 -0.450002 -0.357743 0.329909 -0.504761 -0.507822 -0.417867 -0.413510 -0.259796 -0.449972 0.155003 -0.425385 0.094329 -0.436472 0.281310 0.226136 0.225862 0.281051 0.210829 0.233883 0.232651 0.212245 0.250321 0.405094 0.250122 0.227422 0.212356 0.220280 0.233480 0.223727 0.275997 0.385057
chargesum: 0.00000
title: Mulliken charges with hydrogens summed into heavy atoms:
elementType: O O O N N C C C C C C C C C C C
charge: -0.027935 -0.289561 -0.241184 -0.044908 -0.081746 0.329909 0.002686 -0.000909 0.026846 0.031385 -0.009475 0.027572 0.155003 0.007252 0.094329 0.020736
polarizability: 1.63265526e+02 -3.55430781e+00 1.35924465e+02 1.57517324e+00 -4.94501069e-01 1.07939263e+02
1716.lowfreq: -9.8377 -7.6181 -0.0008 -0.0006 -0.0002 12.8179 24.5704 30.3258 42.5837
frequency: 22.5116 30.2478 42.5180 57.7562 87.2305 91.5750 128.6731 142.4639 188.8670 207.9619 231.7570 253.3635 275.1848 308.1026 384.5478 391.2664 480.3891 485.8480 556.5348 582.6908 586.7306 632.9190 651.0203 682.9095 695.0095 719.1092 731.5100 760.0184 787.5308 803.1383 836.5435 850.8187 876.4312 884.8628 900.7412 906.2521 913.2479 935.2333 965.3884 971.7810 1025.0251 1046.5446 1050.9927 1058.6533 1063.8152 1079.2330 1083.5863 1099.0215 1133.2861 1163.0727 1175.0928 1196.1320 1200.1674 1203.1859 1211.5549 1229.6260 1236.3626 1252.6838 1275.9375 1292.2714 1295.5954 1295.9334 1310.1146 1314.5426 1315.2916 1327.7655 1361.5287 1414.4052 1456.0284 1463.7973 1465.4314 1466.5317 1473.1784 1479.6706 1484.9640 1489.2238 1602.8582 1639.4209 2993.1461 2996.1627 3007.0198 3012.7642 3014.7051 3016.9278 3028.9812 3030.2101 3057.8639 3064.6469 3073.4171 3077.4787 3085.1069 3094.9931 3097.5954 3302.5258 3455.9177 3509.1388
redmass: 2.7600 3.9765 3.8939 4.6877 3.5032 2.4342 4.7291 3.1637 3.0713 2.7125 2.9985 2.6076 4.0526 5.1986 5.2759 5.4217 3.6178 4.8973 2.9766 1.9801 1.5189 2.2120 4.4415 3.0363 2.9052 2.3518 4.6753 1.8831 1.4935 1.5470 4.1816 1.9471 2.2415 1.2270 2.6943 1.9977 2.2214 1.9552 2.2587 2.2331 2.0841 2.1853 1.6804 1.6485 2.4334 2.8258 5.2016 5.7046 2.4051 1.3951 1.3682 1.4459 1.3528 1.4257 1.5532 1.1829 1.5936 1.2785 1.2625 1.2842 1.4451 1.4186 1.5102 1.2229 1.3234 1.4571 1.8156 1.1884 1.0800 1.1347 1.0829 1.0913 1.1020 1.6811 1.1500 1.1968 9.7285 8.1534 1.0670 1.0606 1.0587 1.0592 1.0841 1.0603 1.0641 1.0645 1.1037 1.0986 1.1050 1.1029 1.1049 1.1051 1.1049 1.0767 1.0763 1.0639
irintensity: 0.2910 0.2590 1.6207 3.9217 2.8688 0.8049 0.8376 1.3716 7.2651 0.5926 1.0274 9.1261 11.3282 1.7919 3.7978 4.2927 25.2628 1.8261 28.8506 7.8337 75.0192 40.7944 78.7494 2.2421 46.2296 10.8205 21.0906 10.1204 2.9378 0.2090 6.9529 6.4795 11.0759 90.8364 11.9255 10.0779 2.8650 0.6708 7.8468 36.3586 2.6501 52.4160 2.3392 2.2906 186.0134 2.1375 3.0899 36.8768 11.3075 4.7154 1.1806 8.2335 0.0168 0.1605 2.5508 1.0314 0.0200 0.3145 3.5558 0.0055 13.6262 7.6163 20.0919 3.8767 3.9340 1.0264 24.2265 8.1230 9.8370 73.4963 12.3796 11.5106 24.5492 218.8715 49.9865 88.1314 244.7958 169.3770 37.9458 42.9895 1.7167 34.3993 8.4855 75.2691 35.4607 22.8794 1.2378 25.1865 5.4094 31.4090 8.3392 43.7816 45.1054 166.9611 0.6730 30.0274
temp: 298.150 k
press: 1.00000 atm
elementType: 8 8 8 7 7 6 6 6 6 6 6 6 6 6 6 6 1 1 1 1 1 1 1 1 1 1 1 1 1 1 1 1 1 1
symmnumber: 1
zpe: 751804.0 jmol-1
zpe.correction: 0.286347 hartree
zpe.thermalcorrener: 0.302150 hartree
zpe.thermalcorrenthalpy: 0.303094 hartree
zpe.thermalcorrgfe: 0.240938 hartree
zpe.sumelectzpe: -763.912617 hartree
zpe.sumelectthermal: -763.896814 hartree
zpe.sumelectthermalent: -763.895870 hartree
zpe.sumelectthermalfe: -763.958026 hartree
dipole: -0.7289 2.3174 0.0111
dipole: 2.4294
quadrupole: -76.8693 -104.2696 -91.5786
quadrupole: 0.6910 2.4181 -0.1083
quadrupole: 14.0365 -13.3638 -0.6727 0.6910 2.4181 -0.1083
hfenergy: -764.1989638 hartree
pointgroup: C01 [X(C11H18N2O3)]
dipole: 0.1926461 -0.8821706 0.3133529 debye
polarizability: 161.3207468|-8.2915401|134.3252774|-4.67703|-8.2241054|111.4832305 unknown
InChI: InChI=1S/C11H18N2O3/c14-9(8-4-3-7-12-8)13-11(10(15)16)5-1-2-6-11/h8,12-13,15H,1-7H2
charge 0 multiplicity 1
34 atoms
O  -3.276256 -0.996933 0.921143
O  0.888562 1.803898 -1.084802
O  -1.344728 -2.26013 0.793309
N  0.106719 -0.259336 -0.259766
N  2.457115 -1.484607 -0.403936
C  -1.282121 0.109894 0.052817
C  -1.397357 1.29998 1.074376
C  -2.07277 0.656351 -1.189762
C  -2.782053 1.952157 0.827591
C  -3.198407 1.569704 -0.633713
C  2.413581 -0.131102 -1.04229
C  3.609242 0.703946 -0.451557
C  1.055204 0.574016 -0.790891
C  4.383275 -0.296432 0.453425
C  -1.924316 -1.16332 0.611581
C  3.306085 -1.352092 0.819993
H  -0.586218 2.000052 0.810339
H  -1.247837 0.969076 2.117284
H  -2.44946 -0.159385 -1.83127
H  -1.347546 1.250045 -1.771977
H  -2.723665 3.046608 0.965775
H  -3.52717 1.564349 1.541984
H  -4.16433 1.037903 -0.621045
H  -3.316243 2.46332 -1.272216
H  2.507767 -0.228867 -2.140333
H  0.449591 -1.220472 -0.068315
H  3.215175 1.557209 0.126487
H  4.244853 1.121077 -1.249726
H  5.205648 -0.779309 -0.108114
H  4.819763 0.192657 1.342165
H  3.718451 -2.333102 1.110709
H  2.677833 -0.986269 1.654727
H  2.824117 -2.199709 -1.045266
H  -3.627904 -1.856775 1.280174
