program: Gaussian 09
title: 000248768
version: EM64L-G09RevD.01
frameworkgroup: C1[X(C13H11ClN2O2S)]
method: RPBEPBE
basis: SDD
operation: Freq
keyword: #p
keyword: freq=noraman
keyword: PBEPBE/SDD
title: #p freq=noraman PBEPBE/SDD
converged: YES YES NO NO
title: Mulliken charges:
elementType: Cl S O O N N C C C C C C C C C C C C C H H H H H H H H H H H
charge: -0.047107 0.210126 -0.211882 -0.271506 -0.315497 0.022773 0.371213 0.216024 -0.706485 -0.300062 -0.338201 -0.225553 -0.235616 -0.235906 -0.213396 -0.204587 -0.199656 -0.192169 -0.102402 0.354449 0.270528 0.288981 0.250875 0.286673 0.237652 0.241791 0.261325 0.264740 0.261223 0.261653
chargesum: 0.00000
title: Mulliken charges with hydrogens summed into heavy atoms:
elementType: Cl S O O N N C C C C C C C C C C C C C
charge: -0.047107 0.210126 -0.211882 -0.271506 0.038951 0.022773 0.371213 0.216024 -0.146976 -0.049187 -0.051528 -0.225553 0.002036 0.005885 0.047929 0.060153 0.061566 0.069483 -0.102402
polarizability: 2.53742148e+02 -1.34464320e+01 2.20707777e+02 -3.30522390e+01 -6.81506428e+00 1.29677906e+02
1716.lowfreq: -6.5294 -4.1006 -2.0716 -0.0006 0.0011 0.0013 6.4722 25.8676 37.1702
frequency: -2.8080 25.8234 37.1627 44.8313 67.2096 88.9488 118.2835 136.7102 200.4369 215.0188 244.9516 291.4879 295.2325 318.3488 332.2519 342.3537 394.4824 410.8742 420.2434 441.8894 491.8075 503.7913 520.1386 538.3622 571.7607 589.3484 619.7040 646.6500 657.7246 700.1871 715.2410 718.9822 756.1281 766.2315 814.4600 825.9665 829.2608 837.7560 850.0489 934.9441 953.7675 969.1845 969.6637 989.6011 990.8862 1038.4019 1053.1277 1066.1604 1070.9264 1091.4294 1097.7412 1149.2910 1162.6853 1177.3727 1190.8625 1233.0045 1252.0174 1264.2712 1280.9361 1309.0234 1353.8476 1355.4651 1378.4702 1386.3013 1439.4943 1452.1829 1455.6685 1488.1155 1522.3432 1571.9831 1573.7907 1589.5089 1622.3167 3050.0551 3128.9595 3143.4651 3145.5425 3156.5757 3165.3352 3171.6270 3177.1776 3178.6704 3188.4239 3282.6081
redmass: 9.4199 8.5498 4.7681 6.6139 6.5255 10.2115 6.0273 5.9061 10.3522 7.4362 4.0229 8.2298 4.6982 6.6436 5.2445 7.4297 9.8728 2.9142 3.5787 5.1979 3.9316 5.1790 3.3441 6.9375 5.5706 3.8604 7.1585 7.1593 4.8162 3.9451 7.1189 4.6555 5.6158 1.3830 4.8814 1.3855 1.2385 1.2750 1.4205 1.7546 1.3427 1.3617 1.3570 1.4286 4.2444 2.6770 3.9356 7.3262 1.9395 3.6874 1.3805 1.7400 1.7342 1.1166 1.9002 1.1715 1.4676 1.2653 1.2384 4.6090 3.5806 2.2364 4.0114 3.9825 2.3522 1.7437 1.4503 2.9477 2.5149 6.4275 7.7442 3.0067 6.4722 1.0574 1.1099 1.0875 1.0894 1.0891 1.0900 1.0963 1.0978 1.0939 1.0987 1.0796
irintensity: 0.8894 1.2296 0.1545 0.3813 0.8132 0.1628 0.1162 0.7243 0.7210 0.3046 3.8768 9.1856 3.8332 3.2983 4.8083 0.5290 1.4255 0.1491 1.5324 31.3105 19.7855 14.6634 26.9332 0.5774 28.2953 28.0922 0.2542 7.6082 16.7247 0.9194 10.5174 3.2816 3.0780 92.3535 10.2469 80.6026 51.5977 33.1158 0.6176 16.2004 0.7262 1.4127 4.2630 7.2320 55.9217 15.3578 27.3369 17.3504 50.7805 102.4707 5.4242 57.2465 186.5576 3.2204 190.9273 22.6735 46.6901 49.6748 2.7376 196.3111 27.5396 60.6824 7.0165 5.5357 7.9825 39.2344 41.9437 142.8277 72.1949 13.3131 1.6196 169.8132 105.9164 25.0239 6.0512 4.0602 1.8749 1.0183 9.0908 3.7784 0.6220 4.4533 8.4539 97.4808
temp: 298.150 k
press: 1.00000 atm
elementType: 17 16 8 8 7 7 6 6 6 6 6 6 6 6 6 6 6 6 6 1 1 1 1 1 1 1 1 1 1 1
symmnumber: 1
zpe: 565853.5 jmol-1
zpe.correction: 0.215522 hartree
zpe.thermalcorrener: 0.231750 hartree
zpe.thermalcorrenthalpy: 0.232694 hartree
zpe.thermalcorrgfe: 0.169712 hartree
zpe.sumelectzpe: -1618.624857 hartree
zpe.sumelectthermal: -1618.608629 hartree
zpe.sumelectthermalent: -1618.607685 hartree
zpe.sumelectthermalfe: -1618.670667 hartree
dipole: 3.2872 -0.5077 -3.3317
dipole: 4.7078
quadrupole: -154.4315 -120.6506 -119.7663
quadrupole: 1.0476 4.0619 -4.6342
quadrupole: -22.8154 10.9655 11.8498 1.0476 4.0619 -4.6342
hfenergy: -1618.840379 hartree
pointgroup: C01 [X(C13H11Cl1N2O2S1)]
dipole: 0.4900298 0.9901944 -1.4865957 debye
polarizability: 197.628624|43.2443496|174.4631066|-46.6538114|23.7092793|232.0360999 unknown
InChI: InChI=1S/C13H11ClN2O2S/c14-10-5-7-11(8-6-10)19-9-15-12-3-1-2-4-13(12)16(17)18/h1-8,15H,9H2
charge 0 multiplicity 1
30 atoms
Cl 3.360479 -0.968572 -3.680347
S  1.654911 1.866116 1.879015
O  -4.017148 -1.750658 2.372965
O  -2.676358 -0.124047 3.229635
N  -1.158439 1.288786 1.639441
N  -3.13117 -0.825659 2.21134
C  -1.640804 0.485093 0.61852
C  -2.619877 -0.549283 0.87336
C  -0.201195 2.348555 1.517853
C  -1.221292 0.646843 -0.742118
C  -3.138409 -1.350998 -0.179899
C  2.128628 1.064055 0.291038
C  -1.743442 -0.148891 -1.767687
C  -2.711025 -1.157053 -1.496736
C  2.461102 1.853979 -0.83717
C  2.199043 -0.347489 0.209714
C  2.833194 1.238962 -2.054494
C  2.579848 -0.974348 -0.998466
C  2.881237 -0.168636 -2.114251
H  -1.514308 1.02188 2.575364
H  -0.214912 2.825375 0.527382
H  -0.383327 3.107517 2.294805
H  -0.456311 1.38823 -0.984113
H  -3.876493 -2.114048 0.080136
H  -1.389132 0.005214 -2.792689
H  -3.110449 -1.775924 -2.305026
H  2.445516 2.946402 -0.762233
H  1.948378 -0.954234 1.085009
H  3.092826 1.842136 -2.929302
H  2.632329 -2.064502 -1.068349
