program: Gaussian 09
title: 000248758
version: EM64L-G09RevD.01
frameworkgroup: C1[X(C13H12O2)]
method: RPBEPBE
basis: SDD
operation: Freq
keyword: #pfreq=noraman
keyword: PBEPBE/SDD
title: #p freq=noraman PBEPBE/SDD
converged: YES YES NO NO
title: Mulliken charges:
elementType: O O C C C C C C C C C C C C C H H H H H H H H H H H H
charge: -0.324397 -0.273150 0.190761 0.198324 0.368785 -0.329474 -0.333730 -0.240730 -0.217366 -0.361362 -0.395927 -0.210366 -0.192070 -0.255863 -0.510002 0.260181 0.252605 0.230889 0.230207 0.268378 0.256822 0.227395 0.229596 0.229926 0.246807 0.225657 0.228104
chargesum: 0.00000
title: Mulliken charges with hydrogens summed into heavy atoms:
elementType: O O C C C C C C C C C C C C C
charge: -0.324397 -0.273150 0.190761 0.198324 0.368785 -0.069292 -0.081125 -0.009841 0.012841 -0.092984 -0.139105 0.017029 0.037526 -0.025937 0.190565
polarizability: 1.99321507e+02 9.44539063e+00 1.32897980e+02 -9.14388566e+00 -6.95233204e+00 1.00734264e+02
1716.lowfreq: -7.8290 -5.3774 0.0002 0.0005 0.0008 9.5340 22.1350 40.2813 45.0229
frequency: 21.8369 40.1883 44.9519 82.9430 164.4062 187.5346 223.6847 241.1372 275.9946 289.4770 352.5488 410.8733 436.2430 457.3786 489.2730 510.5498 566.0426 570.5757 604.0036 617.5015 690.9511 692.3406 727.9570 755.4483 759.2933 769.4390 832.6825 848.6505 852.7423 900.3668 937.3713 966.5951 970.7371 971.2372 984.3319 985.8289 1019.0443 1035.1337 1078.4580 1084.6155 1108.1040 1153.4591 1155.6851 1164.5600 1168.6273 1173.9144 1195.7608 1242.3297 1261.9364 1308.5350 1375.0499 1387.7345 1422.1520 1441.7683 1444.2927 1459.0051 1468.7403 1471.4655 1477.1544 1580.8924 1593.8437 1604.3555 1610.5008 2985.8932 3093.5948 3124.7284 3130.4643 3136.2174 3139.4747 3145.9974 3155.9369 3162.0939 3163.9421 3173.3631 3174.8700
redmass: 4.6977 3.4164 3.7775 4.6092 3.4308 4.5345 1.1777 4.6354 3.9762 3.9434 6.5848 2.9435 4.4341 4.3781 3.1874 4.2921 5.1021 6.4792 5.6723 6.1952 3.7935 2.6500 4.0269 1.4610 1.8697 2.9155 1.2548 2.2183 2.4165 1.4106 1.3605 1.3581 1.8758 2.8521 2.4863 1.8870 2.1139 2.0177 1.5007 2.4446 1.2458 1.4338 1.6220 1.0882 1.1495 1.3918 2.4942 3.2219 1.5879 1.3410 8.7450 9.3154 1.6027 2.2516 1.6593 1.0819 1.3166 1.5474 2.3602 7.3592 6.3913 6.7231 6.4401 1.0321 1.1007 1.1052 1.0849 1.0852 1.0890 1.0903 1.0925 1.0946 1.0958 1.1008 1.1005
irintensity: 1.2060 3.8408 0.2918 4.3073 1.0642 1.5090 0.8947 2.7798 1.5362 3.7542 2.0692 0.2504 1.4873 8.2423 9.7562 2.0071 5.2298 2.9983 0.3440 1.1373 18.2332 9.8554 1.8661 120.9929 46.7558 28.6071 0.6288 30.2301 23.1661 4.7067 3.3592 0.1041 12.1761 24.2384 0.3152 0.6179 11.1060 21.2354 12.5419 56.7886 1.3947 6.5654 9.6726 8.2598 4.3649 59.8973 172.8809 197.4081 15.9918 2.3070 24.3513 16.4076 20.9377 1.5700 21.0176 34.4832 79.0484 85.6555 116.2810 28.7052 39.8315 32.4331 41.2001 57.2410 36.9700 26.3238 1.6378 0.3043 11.3538 14.8074 23.2097 13.5292 13.6509 12.3311 13.3225
temp: 298.150 k
press: 1.00000 atm
elementType: 8 8 6 6 6 6 6 6 6 6 6 6 6 6 6 1 1 1 1 1 1 1 1 1 1 1 1
symmnumber: 1
zpe: 558098.7 jmol-1
zpe.correction: 0.212569 hartree
zpe.thermalcorrener: 0.225651 hartree
zpe.thermalcorrenthalpy: 0.226596 hartree
zpe.thermalcorrgfe: 0.171165 hartree
zpe.sumelectzpe: -651.931204 hartree
zpe.sumelectthermal: -651.918121 hartree
zpe.sumelectthermalent: -651.917177 hartree
zpe.sumelectthermalfe: -651.972607 hartree
dipole: 1.3669 -0.5173 0.9149
dipole: 1.7243
quadrupole: -80.3204 -82.4985 -87.3711
quadrupole: 4.7042 -2.1284 -1.2768
quadrupole: 3.0763 0.8982 -3.9745 4.7042 -2.1284 -1.2768
hfenergy: -652.1437727 hartree
pointgroup: C01 [X(C13H12O2)]
dipole: -0.5728814 -0.0586199 -0.3585569 debye
polarizability: 193.4666823|-19.0422114|135.5779641|-12.1354786|13.2863702|103.9091047 unknown
InChI: InChI=1S/C13H12O2/c1-14-12-9-5-6-10-13(12)15-11-7-3-2-4-8-11/h2-10H,1H3
charge 0 multiplicity 1
27 atoms
O  0.104935 0.309242 1.104079
O  2.487814 1.696878 -0.063309
C  1.183146 -0.398391 0.492266
C  2.31414 0.311659 -0.001796
C  -1.193043 0.234836 0.537145
C  1.172323 -1.812031 0.500285
C  3.428229 -0.438877 -0.465978
C  2.278274 -2.543182 0.024551
C  3.414733 -1.845464 -0.454824
C  -1.44734 -0.232205 -0.77374
C  -2.240611 0.711902 1.358167
C  -2.776209 -0.219621 -1.257011
C  -3.559906 0.719405 0.858494
C  -3.835898 0.253091 -0.449745
C  1.33848 2.615296 0.037496
H  0.289829 -2.322167 0.901506
H  4.292095 0.121883 -0.836158
H  2.260253 -3.6374 0.041006
H  4.287638 -2.396613 -0.820392
H  -0.629807 -0.600315 -1.401181
H  -2.006422 1.062767 2.367853
H  -2.978622 -0.580325 -2.271757
H  -4.37365 1.086754 1.493526
H  -4.861696 0.258155 -0.832689
H  0.922514 2.625189 1.057323
H  0.545317 2.344686 -0.683688
H  1.757081 3.600547 -0.219732
