program: Gaussian 09
title: 000248765
version: EM64L-G09RevD.01
frameworkgroup: C1[X(C13H20N2O4S)]
method: RPBEPBE
basis: SDD
operation: Freq
keyword: #p
keyword: freq=noraman
keyword: PBEPBE/SDD
title: #p freq=noraman PBEPBE/SDD
converged: YES YES NO NO
title: Mulliken charges:
elementType: S O O O O N N C C C C C C C C C C C C C H H H H H H H H H H H H H H H H H H H H
charge: 0.898168 -0.530016 -0.547740 -0.425912 -0.224418 -0.461909 -0.574082 -0.371389 -0.399162 -0.363441 -0.434447 -0.203276 -0.003543 0.136209 -0.257318 -0.230750 0.451353 -0.366055 -0.357969 -0.798499 0.211069 0.230092 0.198706 0.210459 0.213444 0.217595 0.248113 0.268507 0.249657 0.299724 0.307023 0.276593 0.289686 0.276222 0.244441 0.243473 0.230459 0.229835 0.244706 0.374395
chargesum: 0.00000
title: Mulliken charges with hydrogens summed into heavy atoms:
elementType: S O O O O N N C C C C C C C C C C C C C
charge: 0.898168 -0.530016 -0.547740 -0.051517 -0.224418 -0.162185 0.009534 0.069773 0.010002 0.067599 0.082172 0.046381 -0.003543 0.136209 0.032367 0.045471 0.451353 -0.121614 -0.114496 -0.093499
polarizability: 2.58944746e+02 2.01014423e+01 1.73326650e+02 -1.63810992e+00 1.58345898e+01 1.54297198e+02
1716.lowfreq: -36.9511 -14.0542 -6.1144 -3.0564 -0.0018 -0.0014 -0.0014 10.6582 16.6155
frequency: -36.6625 9.9787 16.0979 27.0579 32.8458 42.0661 48.5645 53.6900 89.6423 97.3880 129.7119 142.3463 147.1058 215.6762 219.0657 232.8622 247.8493 267.5316 276.0671 287.9195 300.7935 322.6949 333.6642 340.1174 382.9721 406.5604 407.6335 426.3120 454.4758 479.3946 494.5015 511.9690 565.6587 593.3962 622.0076 622.1800 691.9502 708.0281 708.8885 732.1034 771.4859 775.9614 792.7122 797.1658 827.0447 829.3975 849.5597 862.0540 914.1472 930.7445 956.3952 962.2788 982.4111 989.5341 995.0856 1017.9680 1030.8736 1040.0316 1049.5394 1055.5467 1077.3918 1091.5320 1119.4272 1139.7412 1153.3204 1184.9556 1191.9172 1218.4585 1232.9803 1241.3603 1258.2856 1289.0446 1296.8638 1297.2829 1306.4435 1331.6197 1344.0900 1346.9585 1368.4211 1381.6447 1391.5995 1392.4075 1398.9060 1446.4864 1449.5844 1458.2178 1471.0467 1472.8386 1474.5605 1480.2588 1596.0798 1597.1675 1657.9757 1667.9766 2956.0538 2979.0327 2980.8492 2981.1839 2984.5677 3004.0101 3012.7922 3037.4721 3043.8682 3063.4381 3071.1912 3092.7003 3137.1769 3138.7425 3163.6495 3168.1678 3347.0805 3446.4094 3500.3148 3566.7886
redmass: 1.0312 5.4534 6.7945 5.1773 6.2198 5.5582 6.2260 4.6643 3.6679 2.1061 3.9680 5.0706 4.7597 2.7792 5.7981 6.5579 4.5341 3.0224 1.2636 4.6885 3.6262 3.6599 3.8815 2.7077 3.6792 6.8683 2.8713 3.7680 4.4104 3.0583 2.4840 3.2358 3.4560 5.7988 6.9099 1.3806 2.2242 2.0842 3.1399 1.2317 2.7566 3.5610 2.7127 5.9768 1.4109 1.5879 1.2482 2.1280 5.3984 2.8445 2.0180 1.3203 1.3885 1.4306 4.8694 2.9028 2.6791 2.4386 1.5937 2.5036 2.4008 1.9388 1.2857 1.3802 1.3545 1.1392 1.8538 3.0481 1.4360 1.3957 1.4394 1.5715 1.2683 1.2775 1.1790 1.2256 1.3630 1.3862 1.2437 5.4665 1.3566 3.1102 1.2227 1.0671 1.0853 1.0773 1.0940 1.0657 2.3544 1.0973 6.4538 6.4796 5.2648 1.1897 1.0617 1.0624 1.0390 1.0618 1.0775 1.0638 1.0957 1.1018 1.1009 1.0949 1.1036 1.1000 1.0893 1.0894 1.0956 1.0964 1.0743 1.0473 1.0641 1.0959
irintensity: 0.5426 1.8161 0.5085 0.1483 1.8656 2.4580 2.3143 0.0734 1.0728 3.1628 2.5578 1.2255 1.2195 17.2934 3.9087 17.7038 14.3836 13.5721 65.0603 3.8564 0.6720 9.3028 5.8694 19.5875 5.7713 31.0068 0.0293 30.2381 81.4254 15.0544 12.2819 72.1896 19.0359 32.1915 0.1244 125.9715 148.7026 51.5380 7.0119 51.7838 99.7821 3.7949 116.9978 49.0883 29.9447 10.2029 3.7747 1.2489 53.9482 15.8186 28.1410 1.7754 0.9777 1.3654 3.0422 234.1958 9.8643 11.9577 22.6049 22.3234 10.6582 7.8224 8.7455 9.2188 16.3896 13.0809 2.2942 6.0382 10.6341 1.4113 8.3437 2.2817 2.3697 2.2695 5.2041 1.0571 3.3245 0.7310 6.1607 0.3832 5.7938 10.5508 15.7027 20.8042 3.9850 4.6779 16.3348 14.2377 28.3871 14.9460 3.6202 4.5299 130.3107 113.8122 29.1253 6.8401 24.4036 17.6732 24.5122 55.7815 27.8575 8.3938 4.4922 18.7439 39.8411 14.9141 14.0655 7.4365 4.1693 7.2651 10.1028 22.7148 9.7622 16.0597
temp: 298.150 k
press: 1.00000 atm
elementType: 16 8 8 8 8 7 7 6 6 6 6 6 6 6 6 6 6 6 6 6 1 1 1 1 1 1 1 1 1 1 1 1 1 1 1 1 1 1 1 1
symmnumber: 1
zpe: 835119.3 jmol-1
zpe.correction: 0.318080 hartree
zpe.thermalcorrener: 0.340144 hartree
zpe.thermalcorrenthalpy: 0.341088 hartree
zpe.thermalcorrgfe: 0.262473 hartree
zpe.sumelectzpe: -1314.128307 hartree
zpe.sumelectthermal: -1314.106244 hartree
zpe.sumelectthermalent: -1314.105299 hartree
zpe.sumelectthermalfe: -1314.183915 hartree
dipole: -4.1277 2.7863 -1.8270
dipole: 5.3047
quadrupole: -91.4246 -126.1159 -129.8056
quadrupole: 8.8147 1.9466 4.9763
quadrupole: 24.3574 -10.3338 -14.0236 8.8147 1.9466 4.9763
hfenergy: -1314.4463873 hartree
pointgroup: C01 [X(C13H20N2O4S1)]
dipole: 1.6190791 -0.6114669 -1.166351 debye
polarizability: 259.7193334|12.9448297|181.0175507|13.956754|1.4165225|145.83171 unknown
InChI: InChI=1S/C13H20N2O4S/c1-10-5-7-11(8-6-10)20(18,19)15-9-3-2-4-12(14)13(16)17/h5-8,12,15-16H,2-4,9,14H2,1H3
charge 0 multiplicity 1
40 atoms
S  0.674354 -0.499029 0.158753
O  0.216461 -1.620357 1.248189
O  0.05957 1.022742 0.183765
O  -5.802449 -0.600098 0.911765
O  -4.424077 0.770543 2.180864
N  0.417988 -1.319041 -1.531773
N  -3.463071 2.106251 -0.210141
C  -2.653061 -0.762099 -0.861479
C  -2.094695 -1.736731 -1.920034
C  -3.968223 -0.08293 -1.29796
C  -0.702933 -2.306119 -1.556648
C  -4.44229 1.023277 -0.311287
C  2.543239 -0.323854 0.214136
C  -4.838729 0.417446 1.057217
C  3.094671 0.939579 -0.046843
C  3.310541 -1.451846 0.54535
C  5.325287 -0.04008 0.345188
C  4.499969 1.068121 0.020156
C  4.711696 -1.295088 0.606919
C  6.830978 0.119187 0.447703
H  -1.896147 0.020179 -0.666763
H  -2.798697 -1.304627 0.094064
H  -2.035241 -1.22523 -2.904643
H  -2.791944 -2.588635 -2.053615
H  -3.822327 0.41093 -2.277492
H  -4.772753 -0.833173 -1.407635
H  -0.394036 -3.078824 -2.287642
H  -0.724973 -2.789639 -0.559849
H  -5.382987 1.439815 -0.725753
H  0.267052 -0.521078 -2.181734
H  -2.532976 1.809846 0.109898
H  -3.794341 2.910365 0.331634
H  2.444401 1.791314 -0.270524
H  2.830201 -2.411277 0.7605
H  4.958464 2.043406 -0.17897
H  5.33655 -2.158492 0.862516
H  7.358247 -0.804508 0.152224
H  7.196973 0.943028 -0.188791
H  7.13048 0.349074 1.488562
H  -6.053773 -0.940449 1.813573
