program: Gaussian 09
title: 000248760
version: EM64L-G09RevD.01
frameworkgroup: C1[X(C13H16O7)]
method: RPBEPBE
basis: SDD
operation: Freq
keyword: #pfreq=noraman
keyword: PBEPBE/SDD
title: #p freq=noraman PBEPBE/SDD
converged: YES YES NO NO
title: Mulliken charges:
elementType: O O O O O O O C C C C C C C C C C C C C H H H H H H H H H H H H H H H H
charge: -0.179095 -0.240599 -0.284970 -0.256961 -0.215159 -0.237351 -0.238162 0.140031 0.119247 0.041380 -0.229315 0.162651 0.179211 0.207017 -0.256778 -0.257537 -0.255630 -0.656846 -0.662909 -0.664194 0.293310 0.223966 0.237957 0.236465 0.225301 0.228290 0.235282 0.209278 0.262353 0.227779 0.220063 0.253752 0.228096 0.254314 0.230713 0.219050
chargesum: 0.00000
title: Mulliken charges with hydrogens summed into heavy atoms:
elementType: O O O O O O O C C C C C C C C C C C C C
charge: -0.179095 -0.240599 -0.284970 -0.256961 -0.215159 -0.237351 -0.238162 0.140031 0.119247 0.041380 0.063995 0.162651 0.179211 0.207017 0.205145 0.204228 0.207943 0.042563 0.039002 0.039883
polarizability: 2.30870901e+02 1.03512051e+00 1.76003606e+02 4.14999283e-01 6.37310330e+00 1.11135171e+02
1716.lowfreq: -14.3510 -3.0710 -0.8944 -0.0005 -0.0003 0.0007 15.6124 28.0560 31.8378
frequency: 11.5898 27.7928 31.8331 37.0176 47.9518 63.7605 66.8949 83.6698 90.3453 96.0856 107.7510 119.4060 132.5810 176.7212 200.7515 206.6175 225.5697 237.9012 253.4497 281.0602 300.1091 310.4256 317.8948 384.0962 403.4092 431.9642 452.7814 473.0511 504.7202 522.3053 585.2147 650.7800 703.3753 716.4055 719.0386 737.6702 741.6839 761.0121 808.1917 814.1764 815.5816 818.4037 821.7308 829.7863 832.8435 924.0701 983.3637 1002.6377 1012.9638 1024.5652 1072.7816 1095.3742 1096.0265 1098.6623 1107.2842 1113.6812 1156.0820 1157.0045 1158.3637 1216.2652 1232.9934 1271.8286 1276.5039 1278.7419 1288.1071 1349.2944 1352.8824 1356.8092 1389.9096 1393.0111 1395.1365 1410.3037 1455.9122 1457.1832 1458.6444 1461.8606 1462.3510 1463.4828 1481.8074 1484.2578 1484.8969 1510.0394 1569.0972 1610.0944 1637.0285 1642.8301 2994.2302 2994.5129 2996.0966 3031.2339 3031.4392 3034.1880 3089.6408 3089.7589 3091.6651 3095.3476 3096.5382 3100.1808 3121.1076 3122.4013 3125.2817 3274.4138
redmass: 3.4746 3.7742 4.2747 3.2740 2.8007 5.2639 5.0038 3.6792 4.1085 6.7117 4.7762 4.2676 4.0926 2.4837 1.2953 1.2910 1.5988 5.6904 5.5796 3.6921 2.6701 3.3268 3.8712 5.0124 4.5092 3.3386 5.1682 6.6586 7.5161 5.9436 5.2746 9.9701 7.0681 6.8899 3.7187 3.5826 3.5028 4.2423 2.0709 1.4456 1.4700 1.6755 3.0155 2.1331 3.1393 4.5369 3.0608 2.5866 3.0846 4.9858 6.4637 2.2314 2.1951 2.1498 8.2360 3.2975 1.6842 1.6783 1.7118 7.1276 1.8738 1.1300 1.1271 1.1171 4.9561 1.2894 1.3074 1.3911 1.2289 1.2293 1.2251 8.4342 1.1071 1.1186 1.0754 1.0627 1.0484 1.0434 1.0590 1.0573 1.0527 5.6884 10.0558 10.4145 10.5287 11.0150 1.0361 1.0362 1.0367 1.0599 1.0595 1.0596 1.0973 1.0973 1.0974 1.1035 1.1030 1.1036 1.1061 1.1061 1.1055 1.1005
irintensity: 0.5739 1.3797 2.3265 0.2866 0.5237 0.2853 0.5956 1.0159 1.2253 0.5428 3.1624 0.3743 0.4041 0.8776 4.3737 1.5240 4.5287 2.2625 1.4069 0.2459 19.9117 26.9581 10.8113 0.1538 7.0603 6.5635 5.4848 0.9261 1.0039 4.1678 8.2171 10.4050 13.3387 1.2516 6.0067 33.9271 13.4232 9.7967 9.6162 3.3363 8.4635 7.8602 0.5196 11.2316 10.9959 119.9784 41.9593 23.0403 157.3269 276.8477 210.1506 54.2242 10.9690 16.8641 136.4944 75.5789 57.2862 25.6415 19.8138 409.7156 111.6787 4.3600 16.1174 5.9970 253.1766 4.4108 0.0463 7.5415 25.6574 26.5342 24.1396 121.9504 18.4401 15.2038 15.4684 6.4675 15.8017 14.9940 24.3339 11.3300 13.5178 16.5696 61.2276 185.0300 199.5029 189.0930 20.9935 19.0588 19.9476 31.5168 33.0326 27.4781 47.7760 23.8187 36.2478 0.5114 0.7783 1.1673 28.8557 30.8424 28.1904 5.3285
temp: 298.150 k
press: 1.00000 atm
elementType: 8 8 8 8 8 8 8 6 6 6 6 6 6 6 6 6 6 6 6 6 1 1 1 1 1 1 1 1 1 1 1 1 1 1 1 1
symmnumber: 1
zpe: 721572.9 jmol-1
zpe.correction: 0.274833 hartree
zpe.thermalcorrener: 0.296761 hartree
zpe.thermalcorrenthalpy: 0.297705 hartree
zpe.thermalcorrgfe: 0.219571 hartree
zpe.sumelectzpe: -1030.018689 hartree
zpe.sumelectthermal: -1029.996761 hartree
zpe.sumelectthermalent: -1029.995816 hartree
zpe.sumelectthermalfe: -1030.073950 hartree
dipole: 0.9723 -2.2603 -1.6531
dipole: 2.9643
quadrupole: -86.4251 -105.7917 -120.4931
quadrupole: -3.3227 -1.0090 -4.3114
quadrupole: 17.8116 -1.5551 -16.2565 -3.3227 -1.0090 -4.3114
hfenergy: -1030.2935216 hartree
pointgroup: C01 [X(C13H16O7)]
dipole: 0.296717 -0.7632643 -0.8303947 debye
polarizability: 230.3275681|-5.8122445|170.7126595|2.5283765|19.4626048|116.9694507 unknown
InChI: InChI=1S/C13H16O7/c1-4-17-11(14)8-7-20-10(13(16)19-6-3)9(8)12(15)18-5-2/h7H,4-6H2,1-3H3
charge 0 multiplicity 1
36 atoms
O  -1.125081 -1.888893 -1.274597
O  0.434664 2.213734 -0.496342
O  3.045322 -2.147703 -1.066013
O  -3.615859 -0.862035 -0.959992
O  0.360803 1.251136 1.634928
O  3.020996 0.005913 -0.141601
O  -2.79576 1.112754 0.007156
C  -0.022588 -0.105714 -0.344249
C  0.949773 -1.100696 -0.747132
C  -1.274247 -0.611106 -0.67497
C  0.235062 -2.157204 -1.304473
C  0.270227 1.168346 0.391167
C  2.414071 -0.990179 -0.604026
C  -2.60937 -0.023369 -0.499137
C  0.803161 3.539097 0.104373
C  4.538125 -2.1791 -0.95307
C  -5.016306 -0.354788 -0.796936
C  2.318723 3.626002 0.299153
C  4.965549 -2.667696 0.433439
C  -5.547641 -0.675409 0.602493
H  0.540588 -3.10403 -1.73818
H  0.428865 4.265106 -0.63436
H  0.259735 3.649551 1.058798
H  4.925581 -1.16635 -1.160795
H  4.840623 -2.875004 -1.751612
H  -5.570122 -0.887501 -1.585793
H  -5.02043 0.732213 -0.991086
H  2.583276 4.624719 0.693968
H  2.665701 2.861701 1.013255
H  2.848273 3.47545 -0.656769
H  6.066191 -2.769276 0.467407
H  4.662634 -1.950265 1.214116
H  4.521355 -3.6523 0.659239
H  -4.984587 -0.123205 1.373127
H  -5.477979 -1.756617 0.811607
H  -6.610331 -0.377381 0.672008
