program: Gaussian 09
title: 000248757
version: EM64L-G09RevD.01
frameworkgroup: C1[X(C13H12N2O4S)]
method: RPBEPBE
basis: SDD
operation: Freq
keyword: #p
keyword: freq=noraman
keyword: PBEPBE/SDD
title: #p freq=noraman PBEPBE/SDD
converged: YES YES NO NO
title: Mulliken charges:
elementType: S O O O O N N C C C C C C C C C C C C C H H H H H H H H H H H H
charge: 0.985358 -0.524369 -0.495662 -0.220657 -0.222371 -0.741382 0.015067 0.393534 0.362816 0.009141 -0.299167 -0.548265 0.408326 -0.405975 -0.828877 -0.251460 -0.250979 -0.199900 -0.206776 -0.211245 0.372586 0.245692 0.290410 0.287099 0.253264 0.232484 0.238345 0.284242 0.286917 0.247774 0.249144 0.244885
chargesum: 0.00000
title: Mulliken charges with hydrogens summed into heavy atoms:
elementType: S O O O O N N C C C C C C C C C C C C C
charge: 0.985358 -0.524369 -0.495662 -0.220657 -0.222371 -0.368796 0.015067 0.393534 0.362816 0.009141 -0.053475 -0.257855 0.408326 -0.118876 -0.104783 0.032782 0.035937 0.047874 0.042368 0.033640
polarizability: 2.70942298e+02 1.60375250e+01 2.02076811e+02 7.19017215e+00 2.20575167e+01 1.51091708e+02
1716.lowfreq: -9.4633 -6.0565 -4.1633 0.0015 0.0016 0.0018 5.0886 17.3396 43.7030
frequency: -8.8720 17.3105 43.6935 62.0009 70.5080 94.0573 126.8990 146.7713 176.2250 183.5504 195.5837 202.5685 221.3869 222.7523 247.4180 319.9339 333.3445 347.4511 368.0199 404.2408 416.4171 419.2396 441.4203 446.1196 495.4226 512.4733 533.1046 539.5285 600.9879 636.0187 651.9924 682.7622 687.9923 706.0675 738.3699 742.6336 762.0050 799.2847 806.7236 825.9831 847.3074 912.1351 924.7420 934.8690 950.2122 974.2514 976.3320 984.6891 991.8605 1007.2350 1008.4293 1045.3060 1048.2057 1080.6153 1088.9644 1127.4072 1176.3612 1179.6877 1189.9576 1215.8540 1260.5082 1291.7631 1304.9732 1328.0446 1354.2451 1384.7354 1397.1868 1411.2300 1428.8559 1438.1532 1452.9729 1475.8602 1485.2257 1487.7679 1574.6398 1583.6722 1605.2127 1614.9094 2961.9595 3032.7036 3097.8490 3143.3304 3152.6494 3160.6424 3168.1747 3169.5224 3171.1849 3179.3281 3189.3497 3501.7214
redmass: 4.6050 6.2919 4.2734 8.5479 8.5196 8.6213 5.0152 6.6067 8.1194 2.3384 5.3574 1.4884 5.1666 5.6122 8.9882 5.9587 6.4608 4.2069 8.0315 2.7775 5.7943 1.7945 3.7338 3.2844 4.1242 3.9846 4.0852 5.5604 6.4802 8.0188 6.6981 4.9987 2.4258 4.5114 4.0201 9.0136 1.4255 4.5665 9.3807 1.6420 1.2495 5.5739 1.3680 1.3565 12.2644 1.3864 5.5246 1.4154 1.5584 3.0300 1.5524 2.0857 1.5269 1.5498 1.7382 2.2264 1.0563 1.1360 1.6313 6.2196 2.1319 1.5624 1.3019 2.0181 8.7197 8.1487 1.5742 2.4443 3.3478 2.2635 2.0173 1.0594 1.5253 1.9561 5.7897 7.4998 6.9232 6.7106 1.0405 1.0968 1.0958 1.0861 1.0885 1.0927 1.0921 1.0964 1.0892 1.1017 1.0968 1.0770
irintensity: 0.4210 2.0232 0.2444 1.1305 0.8272 3.3559 0.7925 1.0237 0.5014 0.9875 0.2930 0.5053 3.2621 11.4000 6.4602 1.4614 1.0193 28.0735 18.1229 1.2880 15.2231 63.4004 84.1798 32.6280 31.3667 136.4601 0.2379 39.7875 0.0202 40.8464 0.5008 18.4592 16.7743 205.2227 22.2137 7.9577 75.3028 25.4179 113.7978 60.2064 1.0687 19.3536 17.6554 2.3636 60.2745 2.4718 2.1429 0.1720 8.3264 0.2791 0.2097 26.7641 7.2855 3.5871 59.1612 34.5390 0.0842 14.1177 1.0196 554.3597 158.0896 25.5515 3.8615 133.3055 109.2753 6.5107 1.6401 16.8782 43.8523 16.4574 14.9306 17.7765 70.2084 52.6930 3.6012 20.5554 0.8812 194.0942 22.3878 16.9800 12.8731 0.9948 7.5952 1.2527 1.8982 1.8861 1.9795 19.0713 2.2787 66.7286
temp: 298.150 k
press: 1.00000 atm
elementType: 16 8 8 8 8 7 7 6 6 6 6 6 6 6 6 6 6 6 6 6 1 1 1 1 1 1 1 1 1 1 1 1
symmnumber: 1
zpe: 602326.1 jmol-1
zpe.correction: 0.229414 hartree
zpe.thermalcorrener: 0.247399 hartree
zpe.thermalcorrenthalpy: 0.248343 hartree
zpe.thermalcorrgfe: 0.182266 hartree
zpe.sumelectzpe: -1309.352878 hartree
zpe.sumelectthermal: -1309.334893 hartree
zpe.sumelectthermalent: -1309.333949 hartree
zpe.sumelectthermalfe: -1309.400026 hartree
dipole: -6.2487 0.4657 -4.3261
dipole: 7.6143
quadrupole: -154.8042 -117.2317 -124.6318
quadrupole: -30.5267 11.0853 7.9259
quadrupole: -22.5816 14.9909 7.5908 -30.5267 11.0853 7.9259
hfenergy: -1309.582292 hartree
pointgroup: C01 [X(C13H12N2O4S1)]
dipole: -2.4334307 -1.6335967 0.6197257 debye
polarizability: 275.1060429|3.5501909|152.7084394|-6.4671286|22.5835307|196.2963347 unknown
InChI: InChI=1S/C13H12N2O4S/c1-10-9-11(15(16)17)7-8-13(10)14-20(18,19)12-5-3-2-4-6-12/h2-9,14H,1H3
charge 0 multiplicity 1
32 atoms
S  -2.220817 1.302624 -0.044462
O  -3.340599 1.853753 0.994829
O  -1.73399 2.149582 -1.34062
O  4.984551 -0.373007 -1.189643
O  5.428637 -0.251101 1.047147
N  -0.828718 0.996618 1.123759
N  4.620546 -0.175598 0.037333
C  0.516488 0.754891 0.81473
C  1.443866 0.666201 1.912707
C  -2.689049 -0.4350 -0.624157
C  0.966398 0.559887 -0.522494
C  2.785527 0.360486 1.630686
C  3.210712 0.149534 0.298962
C  2.309611 0.254308 -0.78242
C  0.974274 0.886313 3.337458
C  -3.433109 -1.233361 0.259404
C  -2.316291 -0.819422 -1.92094
C  -3.802999 -2.522046 -0.18873
C  -2.697623 -2.113227 -2.347111
C  -3.430898 -2.959247 -1.4828
H  -1.097588 1.374266 2.039897
H  0.274632 0.6944 -1.357307
H  3.520329 0.277617 2.436711
H  2.673991 0.107216 -1.802163
H  1.811522 0.785756 4.046248
H  0.548613 1.900317 3.48167
H  0.198596 0.152352 3.631915
H  -3.728415 -0.860283 1.24506
H  -1.777557 -0.129595 -2.578174
H  -4.383287 -3.177017 0.468837
H  -2.42601 -2.452463 -3.351658
H  -3.722242 -3.958951 -1.821671
