program: Gaussian 09
title: 000248741
version: EM64L-G09RevD.01
frameworkgroup: C1[X(C10H8N4O2)]
method: RPBEPBE
basis: SDD
operation: Freq
keyword: #p
keyword: freq=noraman
keyword: PBEPBE/SDD
title: #p freq=noraman PBEPBE/SDD
converged: NO YES NO NO
title: Mulliken charges:
elementType: O O N N N N C C C C C C C C C C H H H H H H H H
charge: -0.195501 -0.153604 -0.160448 -0.054040 -0.040612 0.015492 -0.422897 -0.421198 0.279090 0.290269 -0.154413 -0.450557 -0.354603 0.359985 -0.230616 -0.347898 0.254066 0.252297 0.253918 0.254267 0.256870 0.250731 0.244028 0.275375
chargesum: 0.00000
title: Mulliken charges with hydrogens summed into heavy atoms:
elementType: O O N N N N C C C C C C C C C C
charge: -0.195501 -0.153604 -0.160448 -0.054040 -0.040612 0.015492 0.083466 0.086986 0.279090 0.290269 -0.154413 -0.193688 -0.103872 0.359985 0.013412 -0.072524
polarizability: 2.20194721e+02 -4.61816424e+00 1.61277258e+02 1.13162379e+00 -2.70961130e+00 7.49445728e+01
1716.lowfreq: -6.4087 -4.6727 -0.0006 -0.0003 0.0004 4.2084 43.4942 52.5869 87.5031
frequency: 43.4902 52.5685 87.4934 119.9697 137.9302 169.2810 185.3564 191.2158 258.0531 315.3231 330.7705 379.8716 424.6484 461.1236 467.0728 540.4613 557.2841 570.3596 598.0081 650.7041 696.1396 711.1525 763.0196 775.3663 792.7977 810.5652 827.5542 846.2759 874.3334 891.6483 921.2781 927.0971 986.7730 998.0552 1056.4944 1074.8415 1088.7401 1098.0695 1114.8634 1121.8243 1141.2921 1149.3760 1169.5133 1195.5078 1221.4894 1237.1194 1256.3325 1359.5617 1377.8244 1386.4499 1408.2698 1436.2947 1459.8402 1478.0931 1499.0619 1506.6579 1552.5430 1615.4786 3070.2272 3077.4177 3151.6282 3159.6857 3168.9170 3177.8790 3181.2389 3193.8458
redmass: 10.6546 7.1779 2.9312 5.0149 4.9271 4.4480 5.6513 4.7329 5.4752 6.0467 6.0853 6.2774 6.4389 5.8225 4.9061 7.9992 6.1411 6.6884 4.8073 6.7852 7.3187 7.5528 1.9782 6.4679 4.8926 1.0815 2.5592 6.7414 1.4993 6.1525 4.6285 1.4779 1.3477 1.1090 3.0609 2.3136 2.4611 1.4832 1.3970 1.8465 1.4323 3.7201 1.7551 2.8031 2.3074 4.3559 2.2909 1.9084 5.9252 9.3305 2.7723 3.9565 1.0780 1.2485 5.7494 5.5031 6.9663 6.9692 1.0488 1.0609 1.0869 1.0917 1.0928 1.1173 1.0994 1.1173
irintensity: 0.2948 1.7724 2.1624 1.7590 3.6795 3.3254 2.4458 3.7106 15.1739 1.0789 0.7893 2.5106 9.3057 5.9023 1.6226 1.4129 1.8842 1.4470 11.7275 13.2497 19.5422 14.9468 34.5295 14.8654 6.6350 28.0014 31.8670 3.6815 20.4355 5.1991 10.0585 4.1645 0.8013 4.6763 8.2902 6.9271 1.2067 7.5209 15.7569 51.0871 0.9605 23.0044 21.6938 15.3125 13.8837 168.9353 6.6545 19.3654 39.2584 117.3843 22.9538 29.3103 6.3945 27.7704 8.3659 320.6558 85.3315 6.5038 13.3169 35.5558 1.7180 12.0733 5.0275 1.4256 6.4217 20.2859
temp: 298.150 k
press: 1.00000 atm
elementType: 8 8 7 7 7 7 6 6 6 6 6 6 6 6 6 6 1 1 1 1 1 1 1 1
symmnumber: 1
zpe: 445904.6 jmol-1
zpe.correction: 0.169836 hartree
zpe.thermalcorrener: 0.182791 hartree
zpe.thermalcorrenthalpy: 0.183735 hartree
zpe.thermalcorrgfe: 0.129449 hartree
zpe.sumelectzpe: -754.011836 hartree
zpe.sumelectthermal: -753.998881 hartree
zpe.sumelectthermalent: -753.997936 hartree
zpe.sumelectthermalfe: -754.052223 hartree
dipole: 8.6818 6.3044 1.1754
dipole: 10.7935
quadrupole: -88.4015 -92.0460 -94.9513
quadrupole: -9.4144 3.1338 1.5592
quadrupole: 3.3981 -0.2464 -3.1517 -9.4144 3.1338 1.5592
hfenergy: -754.1816718 hartree
pointgroup: C01 [X(C10H8N4O2)]
dipole: 3.3720697 -2.4550678 -0.7966058 debye
dipolederiv: -0.8629121 -0.0665483 0.2102781 0.0016973 -0.3604828 0.17398 0.1116265 0.1734869 -0.4022157 -0.5610162 0.160714 -0.0248577 0.1138868 -0.4981791 0.2836326 0.1023244 0.230226 -0.4198503 -1.6387433 0.3399632 0.2312179 0.95568 -0.3396648 0.0843156 -0.2021944 0.2146412 -0.353395 -0.4856314 0.0546506 0.0166024 -0.3317149 -0.1066641 -0.01156 -0.1312523 -0.019159 -0.1781423 0.5882274 -0.2377463 -0.0036899 -0.055559 -0.077889 0.0281686 0.0668337 0.0240996 -0.2216106 1.4322484 -0.1945262 -0.2236921 -0.311156 0.7073432 -0.540573 -0.261976 -0.421071 0.6324931 0.45491 -0.008451 0.0238224 -0.0586199 0.0629481 -0.0958303 0.0109756 -0.1215926 0.2049154 0.3312681 -0.1582693 -0.0849272 -0.2849656 0.2066149 -0.0657501 -0.026427 -0.073297 0.1983203 1.4010126 -0.3190654 -0.0523331 -0.9923894 0.2840497 -0.0282696 0.0989638 -0.0978979 0.0902528 -0.3888204 0.1324912 0.0244591 -0.0602186 -0.0086325 -0.0315483 -0.1097175 -0.0037832 0.0317214 0.0821507 0.093384 0.0333598 0.2717163 0.0049769 0.0281215 0.0048981 0.0544175 0.1199966 -0.3228057 0.1305862 0.0766434 0.7705457 -0.1508804 0.0198157 0.276531 -0.0075467 -0.0403875 0.0224658 -0.071232 0.0071436 0.1048112 -0.0363856 0.0238521 0.0692593 0.0216603 -0.1185817 -0.0192722 0.0362619 0.0320448 0.1115543 -0.0103501 0.0688555 0.0381615 0.0393465 0.0267382 -0.2068649 -0.0179145 0.0027272 -0.0861506 0.1697321 0.0341149 -0.0179077 0.0319015 -0.1342465 0.068154 0.0412455 0.0162477 -0.1301084 -0.0318839 0.0108205 0.0878807 -0.0353513 -0.0957082 -0.0572187 -0.0170933 -0.0678629 -0.0662098 0.0830423 0.0256657 -0.124791 0.0148464 0.0410561 0.0116344 0.0288176 -0.0383734 -0.068335 -0.0375027 0.0943685 0.0716823 0.0611135 0.0516546 0.0070087 0.0491597 -0.0800152 0.017289 0.055648 0.010156 0.0392358 -0.0379362 -0.075251 0.113465 0.0335236 -0.0123353 0.1304047 -0.076105 -0.015439 0.0031397 0.0149717 0.0539575 -0.0517935 -0.0672008 -0.0432771 -0.0501761 0.087696 -0.0173912 -0.0329015 -0.0157587 0.144769 -0.0079572 0.0998214 -0.0057765 0.0444961 0.0538685 -0.0201914 -0.014805 -0.0083067 0.1417481 0.0771343 0.0013426 -0.0093469 0.0011448 -0.0773951 -0.036715 -0.0200044 -0.0373089 0.1518575 0.0133561 -0.0439144 -0.0280591 -0.027623 0.0960955 -0.0225995 -0.0395354 -0.0017023 0.1499083 unknown
polarizability: 220.1412898|2.0058191|158.6817773|6.6288058|14.3855258|77.5934852 unknown
InChI: InChI=1S/C10H8N4O2/c15-14(16)8-3-1-2-7-9(13-4-5-13)6-11-12-10(7)8/h1-3,6H,4-5H2
charge 0 multiplicity 1
24 atoms
O  -4.136075 -0.022887 0.463913
O  -3.181383 1.472436 -0.978019
N  3.035844 -0.309524 0.512466
N  -0.696787 1.737115 0.546387
N  0.453291 2.365392 0.873754
N  -3.135605 0.449639 -0.205046
C  4.332015 0.261667 0.077593
C  3.758696 -0.990034 -0.598471
C  1.798381 0.331079 0.471142
C  0.584997 -0.395165 0.176222
C  -0.632049 0.3832 0.192971
C  1.659826 1.692556 0.818237
C  0.534937 -1.7998 -0.084824
C  -1.856247 -0.300138 -0.113998
C  -0.689375 -2.427807 -0.329748
C  -1.900256 -1.674383 -0.342525
H  5.159696 0.161025 0.785936
H  4.312794 1.19726 -0.496322
H  3.358788 -0.875517 -1.61391
H  4.181238 -1.972252 -0.364199
H  2.527356 2.300903 1.090975
H  1.458029 -2.386079 -0.061575
H  -0.729061 -3.506108 -0.511519
H  -2.86225 -2.159777 -0.530839
