program: Gaussian 09
title: 000248722
version: EM64L-G09RevD.01
frameworkgroup: C1[X(C22H16Cl2N2S2)]
method: RPBEPBE
basis: SDD
operation: Freq
keyword: #p
keyword: freq=noraman
keyword: PBEPBE/SDD
title: #p freq=noraman PBEPBE/SDD
converged: YES YES NO NO
title: Mulliken charges:
elementType: Cl Cl S S N N C C C C C C C C C C C C C C C C C C C C C C H H H H H H H H H H H H H H H H
charge: -0.052159 -0.055875 0.187410 0.229767 -0.079716 -0.051750 0.428473 -0.077425 -0.252601 -0.224516 -0.271401 -0.808451 -0.292505 -0.220431 -0.816104 0.607027 0.571295 -0.340682 -0.292027 -0.366421 -0.307840 -0.349961 -0.217510 -0.227217 -0.219374 -0.231399 -0.222101 -0.220163 0.273495 0.288679 0.291582 0.267854 0.250055 0.291980 0.284760 0.263620 0.242754 0.246952 0.259718 0.236954 0.259333 0.237174 0.239473 0.239272
chargesum: 0.00000
title: Mulliken charges with hydrogens summed into heavy atoms:
elementType: Cl Cl S S N N C C C C C C C C C C C C C C C C C C C C C C
charge: -0.052159 -0.055875 0.187410 0.229767 -0.079716 -0.051750 0.428473 -0.077425 -0.252601 -0.224516 0.002094 -0.228190 -0.024650 0.029624 -0.239364 0.607027 0.571295 -0.077062 -0.292027 -0.123667 -0.307840 -0.103009 0.042208 0.009738 0.039959 0.005774 0.017372 0.019108
polarizability: 4.31129934e+02 -1.75582311e+01 3.72193162e+02 -1.63890269e+00 -2.85887476e+00 1.98322246e+02
1716.lowfreq: -3.2850 -0.9470 -0.0019 -0.0012 -0.0011 3.0014 8.6855 11.5057 13.1149
frequency: 8.5232 11.1727 13.0664 20.2776 30.0558 36.7341 50.4668 60.7523 81.3077 90.9444 115.4534 135.6671 146.4350 151.8586 170.4852 195.4421 234.5139 246.3646 266.3367 269.6555 284.3684 300.1984 341.3813 353.6663 366.1637 396.0896 412.5876 420.5192 425.2416 441.1491 445.8654 454.2459 500.6170 509.1522 512.3768 532.3384 557.7994 567.7526 570.6658 615.0838 633.9651 656.9640 658.8774 660.8325 662.0534 668.0505 736.5565 739.9851 767.3670 769.1087 778.9558 805.7880 817.7418 819.6071 835.3184 853.9700 869.6847 870.7333 873.7860 882.8152 892.5894 902.3458 952.2415 952.8107 958.4810 982.4122 988.8754 988.9551 1018.6327 1018.7872 1039.0290 1039.2768 1049.9275 1061.5057 1103.2012 1107.6175 1124.4446 1138.9090 1147.5165 1152.3164 1175.4284 1175.8948 1212.0728 1217.7924 1221.5122 1236.1181 1245.1192 1261.8004 1265.9467 1281.8107 1283.7056 1329.9548 1377.4594 1378.1909 1394.8693 1415.1531 1425.5304 1426.3349 1451.8423 1453.6157 1460.9753 1465.5916 1466.6262 1498.6122 1525.7931 1575.7644 1576.7123 1605.5093 1605.9552 1607.6197 3029.4365 3051.5601 3110.6392 3130.6387 3132.5627 3133.6547 3140.6007 3145.8393 3146.0534 3158.6847 3159.5333 3163.3898 3163.7807 3172.9001 3177.5482 3177.8312
redmass: 8.7675 8.1942 7.9810 9.4836 6.6677 7.8034 8.5074 7.2650 6.3583 6.5784 8.4877 6.0128 5.4176 5.4666 8.0344 5.3418 5.6587 4.7774 4.9155 5.6926 7.6872 6.4051 8.7467 4.4317 5.7894 6.6197 3.8481 4.9821 4.0559 3.8501 3.4698 4.3958 4.3866 4.4043 3.9689 7.1619 7.4638 6.5822 6.3424 9.4943 5.0613 5.2426 4.9386 6.0924 6.6439 7.6452 3.0493 2.6362 1.3960 1.5129 3.3784 7.6499 4.5506 4.6191 1.5393 5.9507 1.4391 1.4545 1.5644 1.5351 1.3580 1.4519 1.3868 1.3866 6.2149 1.3328 1.3357 1.3347 6.1568 6.2437 2.1226 2.1273 5.6197 2.5366 1.4420 1.5248 4.1757 1.9379 1.1898 1.1443 1.0561 1.0565 2.4768 2.0756 2.2754 1.5423 1.3899 1.5454 1.6673 1.4499 1.4397 2.2144 8.4843 8.1436 3.5506 3.1496 2.0626 2.1654 1.3447 1.1696 2.2272 2.5366 2.5699 7.1991 7.3956 6.1242 6.1849 7.1292 7.0705 6.6784 1.0569 1.0578 1.1084 1.0974 1.0987 1.0874 1.0891 1.0895 1.0899 1.0923 1.0908 1.0949 1.0952 1.0967 1.0999 1.0997
irintensity: 0.7066 0.5779 0.3339 0.0057 0.1377 0.0995 0.0869 0.1202 0.6399 1.1201 3.0586 0.2711 0.1674 1.4123 0.4809 4.9294 1.9313 1.7758 1.6578 3.9913 1.8576 0.0136 2.3403 2.7257 5.0049 3.6957 1.7354 7.7743 4.6858 7.8139 5.4076 4.5561 1.6969 0.3053 1.3454 0.4318 2.1536 20.2844 8.3036 41.8272 27.5115 7.7942 5.9507 7.8924 13.8143 20.9395 19.3771 24.4813 61.1886 55.0907 2.7851 16.2891 4.9216 3.7678 44.7439 15.4820 3.5033 0.4099 4.0432 6.0171 17.6716 0.6238 0.9648 1.7772 34.9707 0.5855 0.0595 0.0202 41.8315 43.1818 3.2134 5.2055 11.5751 34.8466 3.8617 3.7464 60.0116 7.6149 4.0926 1.9402 0.4037 0.5624 55.8968 1.6909 3.2007 30.4411 8.3231 17.7425 3.1182 5.7393 1.6212 22.7196 0.3368 1.5388 10.5146 72.8584 19.0966 23.8825 69.9864 12.6565 36.3616 28.3867 34.2542 11.0373 23.8152 7.2045 9.3775 7.4213 10.6468 156.5363 9.5553 11.1487 1.9219 2.7650 2.8258 3.5287 2.9523 7.9217 9.0165 4.0063 3.0872 12.5536 12.9411 8.2166 13.7822 13.6900
temp: 298.150 k
press: 1.00000 atm
elementType: 17 17 16 16 7 7 6 6 6 6 6 6 6 6 6 6 6 6 6 6 6 6 6 6 6 6 6 6 1 1 1 1 1 1 1 1 1 1 1 1 1 1 1 1
symmnumber: 1
zpe: 832234.7 jmol-1
zpe.correction: 0.316981 hartree
zpe.thermalcorrener: 0.342404 hartree
zpe.thermalcorrenthalpy: 0.343349 hartree
zpe.thermalcorrgfe: 0.254476 hartree
zpe.sumelectzpe: -2671.711233 hartree
zpe.sumelectthermal: -2671.685810 hartree
zpe.sumelectthermalent: -2671.684866 hartree
zpe.sumelectthermalfe: -2671.773738 hartree
dipole: 3.3308 -7.2327 -0.8662
dipole: 8.0098
quadrupole: -171.6094 -196.4059 -189.1275
quadrupole: 20.8541 -11.3796 -0.0441
quadrupole: 14.1049 -10.6916 -3.4133 20.8541 -11.3796 -0.0441
hfenergy: -2672.0282144 hartree
pointgroup: C01 [X(C22H16Cl2N2S2)]
dipole: -1.7288633 -2.6346911 0.0015372 debye
polarizability: 434.8023797|7.2588461|365.6858854|7.5337438|21.312468|201.1570775 unknown
InChI: InChI=1S/C22H16Cl2N2S2/c23-19-7-3-1-5-15(19)13-27-17-9-10-21-18(11-17)22(12-25-26-21)28-14-16-6-2-4-8-20(16)24/h1-12H,13-14H2
charge 0 multiplicity 1
44 atoms
Cl 5.713972 -1.18734 0.839032
Cl -4.478408 -1.120234 -2.42248
S  1.919579 -0.518017 0.359805
S  -3.331315 1.929783 -0.013281
N  2.297437 4.152837 0.206477
N  3.399345 3.371874 0.280134
C  0.833919 2.112783 0.185418
C  1.040902 3.54773 0.164499
C  2.027452 1.317395 0.264849
C  -1.588642 2.461643 0.062838
C  -0.495011 1.591199 0.125834
C  3.168828 -1.031743 -1.026955
C  -0.098507 4.415216 0.09263
C  -1.38337 3.887926 0.047234
C  -3.181797 0.038268 0.226209
C  3.715528 -2.400069 -0.730373
C  -4.564042 -0.552035 0.33597
C  3.257085 1.98732 0.32003
C  4.846344 -2.615825 0.097003
C  3.093108 -3.552896 -1.281796
C  -5.25912 -1.104708 -0.768005
C  -5.230458 -0.57076 1.591511
C  5.350323 -3.899814 0.375382
C  3.576283 -4.851635 -1.017368
C  -6.548782 -1.659251 -0.652481
C  -6.522308 -1.117436 1.73418
C  4.706808 -5.025793 -0.186804
C  -7.183185 -1.663806 0.609594
H  -0.615264 0.504436 0.116967
H  2.604826 -1.01191 -1.971281
H  3.952639 -0.261092 -1.038607
H  0.083538 5.493951 0.079532
H  -2.251011 4.555171 -0.00145
H  -2.631566 -0.363009 -0.638816
H  -2.607052 -0.119314 1.153438
H  4.204283 1.449646 0.422025
H  2.216923 -3.415213 -1.926233
H  -4.71684 -0.141899 2.459681
H  6.228623 -4.01694 1.016524
H  3.077001 -5.720948 -1.457183
H  -7.045238 -2.077575 -1.532532
H  -7.010466 -1.118533 2.713998
H  5.09255 -6.028491 0.024613
H  -8.186014 -2.092389 0.707637
